{"text_format":"1","workbook":"xlsx","n_sheets":15,"sheets":["Resumen","Valores","Calendario","ENERO","FEBRERO","MARZO","ABRIL","MAYO","JUNIO","JULIO","AGOSTO","SEPTIEMBRE","OCTUBRE","NOVIEMBRE","DICIEMBRE"],"not_rendered":{"charts":0,"images":4,"macros":1,"external_links":1,"defined_names":14,"comments":12,"pivot_tables":0},"unopened":[],"bounds":{"document_bytes":16777216,"sheet_cells":100000,"rows_first":2000,"rows_last":500,"rows_between":2000,"halvings":0,"cell_chars":16384,"cell_head_chars":4096},"cells_cut":0,"cells_raw":0,"read":"whole","date_system":"1900"}

{"sheet":"Resumen","index":0,"n_rows":75,"n_cols":19,"rows_kept":75,"cut":false,"hidden":false,"merged":[[12,16,12,17],[53,0,53,14],[46,0,46,14],[31,0,31,14],[12,8,12,14],[15,3,15,5],[14,3,14,5],[13,3,13,5],[12,3,12,5],[13,8,13,14],[14,8,14,14]]}
[]
[]
[]
[]
[]
[]
{"$rows_left_out":70}
{"sheet":"Valores","index":1,"n_rows":62,"n_cols":15,"rows_kept":62,"cut":false,"hidden":true,"merged":[]}
["Tipo día","Enero","Febrero","Marzo","Abril","Mayo","Junio","Julio","Agosto","Septiembre","Octubre","Noviembre","Diciembre",null,"Media semanal horas"]
["Sólo mañana",{"$f":"COUNTIF(ENERO!$D$2:$D$32,Valores!$A2)","v":0},{"$f":"COUNTIF(FEBRERO!$D$2:$D$32,Valores!$A2)","v":0},{"$f":"COUNTIF(MARZO!$D$2:$D$32,Valores!$A2)","v":0},{"$f":"COUNTIF(ABRIL!$D$2:$D$32,Valores!$A2)","v":0},{"$f":"COUNTIF(MAYO!$D$2:$D$32,Valores!$A2)","v":0},{"$f":"COUNTIF(JUNIO!$D$2:$D$32,Valores!$A2)","v":0},{"$f":"COUNTIF(JULIO!$D$2:$D$32,Valores!$A2)","v":0},{"$f":"COUNTIF(AGOSTO!$D$2:$D$32,Valores!$A2)","v":0},{"$f":"COUNTIF(SEPTIEMBRE!$D$2:$D$32,Valores!$A2)","v":0},{"$f":"COUNTIF(OCTUBRE!$D$2:$D$32,Valores!$A2)","v":0},{"$f":"COUNTIF(NOVIEMBRE!$D$2:$D$32,Valores!$A2)","v":0},{"$f":"COUNTIF(DICIEMBRE!$D$2:$D$32,Valores!$A2)","v":0},null,{"$f":"IF(SUM(B2:M3)=0,0,TEXT((SUM(B8:M8)*24),\"0,00\")/(SUM(B2:M3)/5))","v":0}]
["Mañana y Tarde",{"$f":"COUNTIF(ENERO!$D$2:$D$32,Valores!$A3)","v":0},{"$f":"COUNTIF(FEBRERO!$D$2:$D$32,Valores!$A3)","v":0},{"$f":"COUNTIF(MARZO!$D$2:$D$32,Valores!$A3)","v":0},{"$f":"COUNTIF(ABRIL!$D$2:$D$32,Valores!$A3)","v":0},{"$f":"COUNTIF(MAYO!$D$2:$D$32,Valores!$A3)","v":0},{"$f":"COUNTIF(JUNIO!$D$2:$D$32,Valores!$A3)","v":0},{"$f":"COUNTIF(JULIO!$D$2:$D$32,Valores!$A3)","v":0},{"$f":"COUNTIF(AGOSTO!$D$2:$D$32,Valores!$A3)","v":0},{"$f":"COUNTIF(SEPTIEMBRE!$D$2:$D$32,Valores!$A3)","v":0},{"$f":"COUNTIF(OCTUBRE!$D$2:$D$32,Valores!$A3)","v":0},{"$f":"COUNTIF(NOVIEMBRE!$D$2:$D$32,Valores!$A3)","v":0},{"$f":"COUNTIF(DICIEMBRE!$D$2:$D$32,Valores!$A3)","v":0}]
["Fin de semana",{"$f":"COUNTIF(ENERO!$D$2:$D$32,Valores!$A4)","v":8},{"$f":"COUNTIF(FEBRERO!$D$2:$D$32,Valores!$A4)","v":8},{"$f":"COUNTIF(MARZO!$D$2:$D$32,Valores!$A4)","v":10},{"$f":"COUNTIF(ABRIL!$D$2:$D$32,Valores!$A4)","v":8},{"$f":"COUNTIF(MAYO!$D$2:$D$32,Valores!$A4)","v":8},{"$f":"COUNTIF(JUNIO!$D$2:$D$32,Valores!$A4)","v":10},{"$f":"COUNTIF(JULIO!$D$2:$D$32,Valores!$A4)","v":8},{"$f":"COUNTIF(AGOSTO!$D$2:$D$32,Valores!$A4)","v":9},{"$f":"COUNTIF(SEPTIEMBRE!$D$2:$D$32,Valores!$A4)","v":9},{"$f":"COUNTIF(OCTUBRE!$D$2:$D$32,Valores!$A4)","v":7},{"$f":"COUNTIF(NOVIEMBRE!$D$2:$D$32,Valores!$A4)","v":9},{"$f":"COUNTIF(DICIEMBRE!$D$2:$D$32,Valores!$A4)","v":9}]
["Festivo",{"$f":"COUNTIF(ENERO!$D$2:$D$32,Valores!$A5)","v":1},{"$f":"COUNTIF(FEBRERO!$D$2:$D$32,Valores!$A5)","v":0},{"$f":"COUNTIF(MARZO!$D$2:$D$32,Valores!$A5)","v":0},{"$f":"COUNTIF(ABRIL!$D$2:$D$32,Valores!$A5)","v":0},{"$f":"COUNTIF(MAYO!$D$2:$D$32,Valores!$A5)","v":1},{"$f":"COUNTIF(JUNIO!$D$2:$D$32,Valores!$A5)","v":0},{"$f":"COUNTIF(JULIO!$D$2:$D$32,Valores!$A5)","v":0},{"$f":"COUNTIF(AGOSTO!$D$2:$D$32,Valores!$A5)","v":1},{"$f":"COUNTIF(SEPTIEMBRE!$D$2:$D$32,Valores!$A5)","v":0},{"$f":"COUNTIF(OCTUBRE!$D$2:$D$32,Valores!$A5)","v":1},{"$f":"COUNTIF(NOVIEMBRE!$D$2:$D$32,Valores!$A5)","v":1},{"$f":"COUNTIF(DICIEMBRE!$D$2:$D$32,Valores!$A5)","v":2}]
["Vacaciones",{"$f":"COUNTIF(ENERO!$D$2:$D$32,Valores!$A6)","v":0},{"$f":"COUNTIF(FEBRERO!$D$2:$D$32,Valores!$A6)","v":0},{"$f":"COUNTIF(MARZO!$D$2:$D$32,Valores!$A6)","v":0},{"$f":"COUNTIF(ABRIL!$D$2:$D$32,Valores!$A6)","v":0},{"$f":"COUNTIF(MAYO!$D$2:$D$32,Valores!$A6)","v":0},{"$f":"COUNTIF(JUNIO!$D$2:$D$32,Valores!$A6)","v":0},{"$f":"COUNTIF(JULIO!$D$2:$D$32,Valores!$A6)","v":0},{"$f":"COUNTIF(AGOSTO!$D$2:$D$32,Valores!$A6)","v":0},{"$f":"COUNTIF(SEPTIEMBRE!$D$2:$D$32,Valores!$A6)","v":0},{"$f":"COUNTIF(OCTUBRE!$D$2:$D$32,Valores!$A6)","v":0},{"$f":"COUNTIF(NOVIEMBRE!$D$2:$D$32,Valores!$A6)","v":0},{"$f":"COUNTIF(DICIEMBRE!$D$2:$D$32,Valores!$A6)","v":0}]
{"$rows_left_out":57}
{"sheet":"Calendario","index":2,"n_rows":365,"n_cols":30,"rows_kept":365,"cut":false,"hidden":false,"merged":[[18,4,18,10],[18,13,18,19],[18,22,18,28],[26,4,26,10],[26,13,26,19],[26,22,26,28],[2,4,2,10],[2,13,2,19],[2,22,2,28],[10,4,10,10],[10,13,10,19],[10,22,10,28],[0,27,0,29],[0,4,0,8],[0,10,0,13],[0,15,0,17],[0,19,0,21],[0,23,0,25]]}
["2019-01-01",1,{"$f":"VLOOKUP(A1,ENERO!B2:D32,3,FALSE)","v":"Festivo"},null,"Fin de semana o Festivo",null,null,null,null,null,"IT o Permiso reglam.",null,null,null,null,"Vacaciones",null,null,null,"Día CON tarde",null,null,null,"Día SIN Tarde",null,null,null,"Semana actual"]
["2019-01-02",2,{"$f":"VLOOKUP(A2,ENERO!B3:D33,3,FALSE)","v":""}]
["2019-01-03",3,{"$f":"VLOOKUP(A3,ENERO!B4:D34,3,FALSE)","v":""},null,"ENERO(T: 0 H: 0,00)",null,null,null,null,null,null,null,null,"FEBRERO(T: 0 H: 0,00)",null,null,null,null,null,null,null,null,"MARZO(T: 0 H: 0,00)"]
["2019-01-04",4,{"$f":"VLOOKUP(A4,ENERO!B5:D35,3,FALSE)","v":""},null,"L","M","X","J","V","S","D","HTS",null,"L","M","X","J","V","S","D","HTS",null,"L","M","X","J","V","S","D","HTS"]
["2019-01-05",5,{"$f":"VLOOKUP(A5,ENERO!B6:D36,3,FALSE)","v":"Fin de semana"},1,null,1,2,3,4,5,6,{"$f":"VLOOKUP(Calendario!D5,Resumen!$Q$15:$R$67,2,FALSE)","v":"00,00"},5,null,null,null,null,1,2,3,{"$f":"VLOOKUP(Calendario!M5,Resumen!$Q$15:$R$67,2,FALSE)","v":"00,00"},9,null,null,null,null,1,2,3,{"$f":"VLOOKUP(Calendario!V5,Resumen!$Q$15:$R$67,2,FALSE)","v":"00,00"}]
["2019-01-06",6,{"$f":"VLOOKUP(A6,ENERO!B7:D37,3,FALSE)","v":"Fin de semana"},2,7,8,9,10,11,12,13,{"$f":"VLOOKUP(Calendario!D6,Resumen!$Q$15:$R$67,2,FALSE)","v":"00,00"},6,4,5,6,7,8,9,10,{"$f":"VLOOKUP(Calendario!M6,Resumen!$Q$15:$R$67,2,FALSE)","v":"00,00"},10,4,5,6,7,8,9,10,{"$f":"VLOOKUP(Calendario!V6,Resumen!$Q$15:$R$67,2,FALSE)","v":"00,00"}]
{"$rows_left_out":360}
{"sheet":"ENERO","index":3,"n_rows":32,"n_cols":13,"rows_kept":32,"cut":false,"hidden":false,"merged":[]}
["SEMANA","Día","Día Semana","Tipo día","Entrada","Descanso","Salida","Total mañana","Entrada","Descanso","Salida","Total Tarde","Notas del día"]
[{"$f":"_xlfn.ISOWEEKNUM(B2)","v":1},"2019-01-01",{"$f":"WEEKDAY(B2,1)","v":"1900-01-03"},"Festivo",null,null,null,{"$f":"IF($G2-$E2=0,\"\",$G2-$E2-$F2)","v":""},null,null,null,{"$f":"IF(AND($D2<>\"Mañana y Tarde\",OR($I2<>\"\",$K2<>\"\")),\"El tipo de día debe ser Mañana y Tarde o no haber horas por la tarde\",IF($K2-$I2=0,\"\",$K2-$I2-$J2))","v":""}]
[{"$f":"_xlfn.ISOWEEKNUM(B3)","v":1},"2019-01-02",{"$f":"WEEKDAY(B3,1)","v":"1900-01-04"},{"$f":"IF(OR(C3=1,C3=7),\"Fin de semana\",\"\")","v":""},null,null,null,{"$f":"IF($G3-$E3=0,\"\",$G3-$E3-$F3)","v":""},null,null,null,{"$f":"IF(AND($D3<>\"Mañana y Tarde\",OR($I3<>\"\",$K3<>\"\")),\"El tipo de día debe ser Mañana y Tarde o no haber horas por la tarde\",IF($K3-$I3=0,\"\",$K3-$I3-$J3))","v":""}]
[1,"2019-01-03","1900-01-05","",null,null,null,"",null,null,null,""]
[1,"2019-01-04","1900-01-06","",null,null,null,"",null,null,null,""]
[1,"2019-01-05","1900-01-07",{"$f":"IF(OR(C6=1,C6=7),\"Fin de semana\",\"\")","v":"Fin de semana"},null,null,null,"",null,null,null,""]
{"$rows_left_out":27}
{"sheet":"FEBRERO","index":4,"n_rows":29,"n_cols":13,"rows_kept":29,"cut":false,"hidden":false,"merged":[]}
["SEMANA","Día","Día Semana","Tipo día","Entrada","Descanso","Salida","Total mañana","Entrada","Descanso","Salida","Total Tarde","Notas del día"]
[{"$f":"_xlfn.ISOWEEKNUM(B2)","v":5},"2019-02-01",{"$f":"WEEKDAY(B2,1)","v":"1900-01-06"},{"$f":"IF(OR(C2=1,C2=7),\"Fin de semana\",\"\")","v":""},null,null,null,{"$f":"IF($G2-$E2=0,\"\",$G2-$E2-$F2)","v":""},null,null,null,{"$f":"IF(AND($D2<>\"Mañana y Tarde\",OR($I2<>\"\",$K2<>\"\")),\"El tipo de día debe ser Mañana y Tarde o no haber horas por la tarde\",IF($K2-$I2=0,\"\",$K2-$I2-$J2))","v":""}]
[{"$f":"_xlfn.ISOWEEKNUM(B3)","v":5},"2019-02-02",{"$f":"WEEKDAY(B3,1)","v":"1900-01-07"},{"$f":"IF(OR(C3=1,C3=7),\"Fin de semana\",\"\")","v":"Fin de semana"},null,null,null,{"$f":"IF($G3-$E3=0,\"\",$G3-$E3-$F3)","v":""},null,null,null,{"$f":"IF(AND($D3<>\"Mañana y Tarde\",OR($I3<>\"\",$K3<>\"\")),\"El tipo de día debe ser Mañana y Tarde o no haber horas por la tarde\",IF($K3-$I3=0,\"\",$K3-$I3-$J3))","v":""}]
[5,"2019-02-03","1900-01-01","Fin de semana",null,null,null,"",null,null,null,""]
[6,"2019-02-04","1900-01-02","",null,null,null,"",null,null,null,""]
[6,"2019-02-05","1900-01-03","",null,null,null,"",null,null,null,""]
{"$rows_left_out":24}
{"sheet":"MARZO","index":5,"n_rows":32,"n_cols":13,"rows_kept":32,"cut":false,"hidden":false,"merged":[]}
["SEMANA","Día","Día Semana","Tipo día","Entrada","Descanso","Salida","Total mañana","Entrada","Descanso","Salida","Total Tarde","Notas del día"]
[{"$f":"_xlfn.ISOWEEKNUM(B2)","v":9},"2019-03-01",{"$f":"WEEKDAY(B2,1)","v":"1900-01-06"},{"$f":"IF(OR(C2=1,C2=7),\"Fin de semana\",\"\")","v":""},null,null,null,{"$f":"IF($G2-$E2=0,\"\",$G2-$E2-$F2)","v":""},null,null,null,{"$f":"IF(AND($D2<>\"Mañana y Tarde\",OR($I2<>\"\",$K2<>\"\")),\"El tipo de día debe ser Mañana y Tarde o no haber horas por la tarde\",IF($K2-$I2=0,\"\",$K2-$I2-$J2))","v":""}]
[{"$f":"_xlfn.ISOWEEKNUM(B3)","v":9},"2019-03-02",{"$f":"WEEKDAY(B3,1)","v":"1900-01-07"},{"$f":"IF(OR(C3=1,C3=7),\"Fin de semana\",\"\")","v":"Fin de semana"},null,null,null,{"$f":"IF($G3-$E3=0,\"\",$G3-$E3-$F3)","v":""},null,null,null,{"$f":"IF(AND($D3<>\"Mañana y Tarde\",OR($I3<>\"\",$K3<>\"\")),\"El tipo de día debe ser Mañana y Tarde o no haber horas por la tarde\",IF($K3-$I3=0,\"\",$K3-$I3-$J3))","v":""}]
[9,"2019-03-03","1900-01-01",{"$f":"IF(OR(C4=1,C4=7),\"Fin de semana\",\"\")","v":"Fin de semana"},null,null,null,"",null,null,null,""]
[10,"2019-03-04","1900-01-02","",null,null,null,"",null,null,null,""]
[10,"2019-03-05","1900-01-03","",null,null,null,"",null,null,null,""]
{"$rows_left_out":27}
{"sheet":"ABRIL","index":6,"n_rows":31,"n_cols":13,"rows_kept":31,"cut":false,"hidden":false,"merged":[]}
["SEMANA","Día","Día Semana","Tipo día","Entrada","Descanso","Salida","Total mañana","Entrada","Descanso","Salida","Total Tarde","Notas del día"]
[{"$f":"_xlfn.ISOWEEKNUM(B2)","v":14},"2019-04-01",{"$f":"WEEKDAY(B2,1)","v":"1900-01-02"},{"$f":"IF(OR(C2=1,C2=7),\"Fin de semana\",\"\")","v":""},null,null,null,{"$f":"IF($G2-$E2=0,\"\",$G2-$E2-$F2)","v":""},null,null,null,{"$f":"IF(AND($D2<>\"Mañana y Tarde\",OR($I2<>\"\",$K2<>\"\")),\"El tipo de día debe ser Mañana y Tarde o no haber horas por la tarde\",IF($K2-$I2=0,\"\",$K2-$I2-$J2))","v":""}]
[{"$f":"_xlfn.ISOWEEKNUM(B3)","v":14},"2019-04-02",{"$f":"WEEKDAY(B3,1)","v":"1900-01-03"},{"$f":"IF(OR(C3=1,C3=7),\"Fin de semana\",\"\")","v":""},null,null,null,{"$f":"IF($G3-$E3=0,\"\",$G3-$E3-$F3)","v":""},null,null,null,{"$f":"IF(AND($D3<>\"Mañana y Tarde\",OR($I3<>\"\",$K3<>\"\")),\"El tipo de día debe ser Mañana y Tarde o no haber horas por la tarde\",IF($K3-$I3=0,\"\",$K3-$I3-$J3))","v":""}]
[14,"2019-04-03","1900-01-04",{"$f":"IF(OR(C4=1,C4=7),\"Fin de semana\",\"\")","v":""},null,null,null,"",null,null,null,""]
[14,"2019-04-04","1900-01-05","",null,null,null,"",null,null,null,""]
[14,"2019-04-05","1900-01-06","",null,null,null,"",null,null,null,""]
{"$rows_left_out":26}
{"sheet":"MAYO","index":7,"n_rows":32,"n_cols":13,"rows_kept":32,"cut":false,"hidden":false,"merged":[]}
["SEMANA","Día","Día Semana","Tipo día","Entrada","Descanso","Salida","Total mañana","Entrada","Descanso","Salida","Total Tarde","Notas del día"]
[{"$f":"_xlfn.ISOWEEKNUM(B2)","v":18},"2019-05-01",{"$f":"WEEKDAY(B2,1)","v":"1900-01-04"},"Festivo",null,null,null,{"$f":"IF($G2-$E2=0,\"\",$G2-$E2-$F2)","v":""},null,null,null,{"$f":"IF(AND($D2<>\"Mañana y Tarde\",OR($I2<>\"\",$K2<>\"\")),\"El tipo de día debe ser Mañana y Tarde o no haber horas por la tarde\",IF($K2-$I2=0,\"\",$K2-$I2-$J2))","v":""}]
[{"$f":"_xlfn.ISOWEEKNUM(B3)","v":18},"2019-05-02",{"$f":"WEEKDAY(B3,1)","v":"1900-01-05"},{"$f":"IF(OR(C3=1,C3=7),\"Fin de semana\",\"\")","v":""},null,null,null,{"$f":"IF($G3-$E3=0,\"\",$G3-$E3-$F3)","v":""},null,null,null,{"$f":"IF(AND($D3<>\"Mañana y Tarde\",OR($I3<>\"\",$K3<>\"\")),\"El tipo de día debe ser Mañana y Tarde o no haber horas por la tarde\",IF($K3-$I3=0,\"\",$K3-$I3-$J3))","v":""}]
[18,"2019-05-03","1900-01-06",{"$f":"IF(OR(C4=1,C4=7),\"Fin de semana\",\"\")","v":""},null,null,null,"",null,null,null,""]
[18,"2019-05-04","1900-01-07","Fin de semana",null,null,null,"",null,null,null,""]
[18,"2019-05-05","1900-01-01","Fin de semana",null,null,null,"",null,null,null,""]
{"$rows_left_out":27}
{"sheet":"JUNIO","index":8,"n_rows":31,"n_cols":13,"rows_kept":31,"cut":false,"hidden":false,"merged":[]}
["SEMANA","Día","Día Semana","Tipo día","Entrada","Descanso","Salida","Total mañana","Entrada","Descanso","Salida","Total Tarde","Notas del día"]
[{"$f":"_xlfn.ISOWEEKNUM(B2)","v":22},"2019-06-01",{"$f":"WEEKDAY(B2,1)","v":"1900-01-07"},{"$f":"IF(OR(C2=1,C2=7),\"Fin de semana\",\"\")","v":"Fin de semana"},null,null,null,{"$f":"IF($G2-$E2=0,\"\",$G2-$E2-$F2)","v":""},null,null,null,{"$f":"IF(AND($D2<>\"Mañana y Tarde\",OR($I2<>\"\",$K2<>\"\")),\"El tipo de día debe ser Mañana y Tarde o no haber horas por la tarde\",IF($K2-$I2=0,\"\",$K2-$I2-$J2))","v":""}]
[{"$f":"_xlfn.ISOWEEKNUM(B3)","v":22},"2019-06-02",{"$f":"WEEKDAY(B3,1)","v":"1900-01-01"},{"$f":"IF(OR(C3=1,C3=7),\"Fin de semana\",\"\")","v":"Fin de semana"},null,null,null,{"$f":"IF($G3-$E3=0,\"\",$G3-$E3-$F3)","v":""},null,null,null,{"$f":"IF(AND($D3<>\"Mañana y Tarde\",OR($I3<>\"\",$K3<>\"\")),\"El tipo de día debe ser Mañana y Tarde o no haber horas por la tarde\",IF($K3-$I3=0,\"\",$K3-$I3-$J3))","v":""}]
[23,"2019-06-03","1900-01-02",{"$f":"IF(OR(C4=1,C4=7),\"Fin de semana\",\"\")","v":""},null,null,null,"",null,null,null,""]
[23,"2019-06-04","1900-01-03","",null,null,null,"",null,null,null,""]
[23,"2019-06-05","1900-01-04","",null,null,null,"",null,null,null,""]
{"$rows_left_out":26}
{"sheet":"JULIO","index":9,"n_rows":32,"n_cols":13,"rows_kept":32,"cut":false,"hidden":false,"merged":[]}
["SEMANA","Día","Día Semana","Tipo día","Entrada","Descanso","Salida","Total mañana","Entrada","Descanso","Salida","Total Tarde","Notas del día"]
[{"$f":"_xlfn.ISOWEEKNUM(B2)","v":27},"2019-07-01",{"$f":"WEEKDAY(B2,1)","v":"1900-01-02"},{"$f":"IF(OR(C2=1,C2=7),\"Fin de semana\",\"\")","v":""},null,null,null,{"$f":"IF($G2-$E2=0,\"\",$G2-$E2-$F2)","v":""},null,null,null,{"$f":"IF(AND($D2<>\"Mañana y Tarde\",OR($I2<>\"\",$K2<>\"\")),\"El tipo de día debe ser Mañana y Tarde o no haber horas por la tarde\",IF($K2-$I2=0,\"\",$K2-$I2-$J2))","v":""}]
[{"$f":"_xlfn.ISOWEEKNUM(B3)","v":27},"2019-07-02",{"$f":"WEEKDAY(B3,1)","v":"1900-01-03"},{"$f":"IF(OR(C3=1,C3=7),\"Fin de semana\",\"\")","v":""},null,null,null,{"$f":"IF($G3-$E3=0,\"\",$G3-$E3-$F3)","v":""},null,null,null,{"$f":"IF(AND($D3<>\"Mañana y Tarde\",OR($I3<>\"\",$K3<>\"\")),\"El tipo de día debe ser Mañana y Tarde o no haber horas por la tarde\",IF($K3-$I3=0,\"\",$K3-$I3-$J3))","v":""}]
[27,"2019-07-03","1900-01-04",{"$f":"IF(OR(C4=1,C4=7),\"Fin de semana\",\"\")","v":""},null,null,null,"",null,null,null,""]
[27,"2019-07-04","1900-01-05","",null,null,null,"",null,null,null,""]
[27,"2019-07-05","1900-01-06","",null,null,null,"",null,null,null,""]
{"$rows_left_out":27}
{"sheet":"AGOSTO","index":10,"n_rows":32,"n_cols":13,"rows_kept":32,"cut":false,"hidden":false,"merged":[]}
["SEMANA","Día","Día Semana","Tipo día","Entrada","Descanso","Salida","Total mañana","Entrada","Descanso","Salida","Total Tarde","Notas del día"]
[{"$f":"_xlfn.ISOWEEKNUM(B2)","v":31},"2019-08-01",{"$f":"WEEKDAY(B2,1)","v":"1900-01-05"},{"$f":"IF(OR(C2=1,C2=7),\"Fin de semana\",\"\")","v":""},null,null,null,{"$f":"IF($G2-$E2=0,\"\",$G2-$E2-$F2)","v":""},null,null,null,{"$f":"IF(AND($D2<>\"Mañana y Tarde\",OR($I2<>\"\",$K2<>\"\")),\"El tipo de día debe ser Mañana y Tarde o no haber horas por la tarde\",IF($K2-$I2=0,\"\",$K2-$I2-$J2))","v":""}]
[{"$f":"_xlfn.ISOWEEKNUM(B3)","v":31},"2019-08-02",{"$f":"WEEKDAY(B3,1)","v":"1900-01-06"},{"$f":"IF(OR(C3=1,C3=7),\"Fin de semana\",\"\")","v":""},null,null,null,{"$f":"IF($G3-$E3=0,\"\",$G3-$E3-$F3)","v":""},null,null,null,{"$f":"IF(AND($D3<>\"Mañana y Tarde\",OR($I3<>\"\",$K3<>\"\")),\"El tipo de día debe ser Mañana y Tarde o no haber horas por la tarde\",IF($K3-$I3=0,\"\",$K3-$I3-$J3))","v":""}]
[31,"2019-08-03","1900-01-07",{"$f":"IF(OR(C4=1,C4=7),\"Fin de semana\",\"\")","v":"Fin de semana"},null,null,null,"",null,null,null,""]
[31,"2019-08-04","1900-01-01","Fin de semana",null,null,null,"",null,null,null,""]
[32,"2019-08-05","1900-01-02","",null,null,null,"",null,null,null,""]
{"$rows_left_out":27}
{"sheet":"SEPTIEMBRE","index":11,"n_rows":31,"n_cols":13,"rows_kept":31,"cut":false,"hidden":false,"merged":[]}
["SEMANA","Día","Día Semana","Tipo día","Entrada","Descanso","Salida","Total mañana","Entrada","Descanso","Salida","Total Tarde","Notas del día"]
[{"$f":"_xlfn.ISOWEEKNUM(B2)","v":35},"2019-09-01",{"$f":"WEEKDAY(B2,1)","v":"1900-01-01"},{"$f":"IF(OR(C2=1,C2=7),\"Fin de semana\",\"\")","v":"Fin de semana"},null,null,null,{"$f":"IF($G2-$E2=0,\"\",$G2-$E2-$F2)","v":""},null,null,null,{"$f":"IF(AND($D2<>\"Mañana y Tarde\",OR($I2<>\"\",$K2<>\"\")),\"El tipo de día debe ser Mañana y Tarde o no haber horas por la tarde\",IF($K2-$I2=0,\"\",$K2-$I2-$J2))","v":""}]
[{"$f":"_xlfn.ISOWEEKNUM(B3)","v":36},"2019-09-02",{"$f":"WEEKDAY(B3,1)","v":"1900-01-02"},{"$f":"IF(OR(C3=1,C3=7),\"Fin de semana\",\"\")","v":""},null,null,null,{"$f":"IF($G3-$E3=0,\"\",$G3-$E3-$F3)","v":""},null,null,null,{"$f":"IF(AND($D3<>\"Mañana y Tarde\",OR($I3<>\"\",$K3<>\"\")),\"El tipo de día debe ser Mañana y Tarde o no haber horas por la tarde\",IF($K3-$I3=0,\"\",$K3-$I3-$J3))","v":""}]
[36,"2019-09-03","1900-01-03",{"$f":"IF(OR(C4=1,C4=7),\"Fin de semana\",\"\")","v":""},null,null,null,"",null,null,null,""]
[36,"2019-09-04","1900-01-04","",null,null,null,"",null,null,null,""]
[36,"2019-09-05","1900-01-05","",null,null,null,"",null,null,null,""]
{"$rows_left_out":26}
{"sheet":"OCTUBRE","index":12,"n_rows":32,"n_cols":13,"rows_kept":32,"cut":false,"hidden":false,"merged":[]}
["SEMANA","Día","Día Semana","Tipo día","Entrada","Descanso","Salida","Total mañana","Entrada","Descanso","Salida","Total Tarde","Notas del día"]
[{"$f":"_xlfn.ISOWEEKNUM(B2)","v":40},"2019-10-01",{"$f":"WEEKDAY(B2,1)","v":"1900-01-03"},{"$f":"IF(OR(C2=1,C2=7),\"Fin de semana\",\"\")","v":""},null,null,null,{"$f":"IF($G2-$E2=0,\"\",$G2-$E2-$F2)","v":""},null,null,null,{"$f":"IF(AND($D2<>\"Mañana y Tarde\",OR($I2<>\"\",$K2<>\"\")),\"El tipo de día debe ser Mañana y Tarde o no haber horas por la tarde\",IF($K2-$I2=0,\"\",$K2-$I2-$J2))","v":""}]
[{"$f":"_xlfn.ISOWEEKNUM(B3)","v":40},"2019-10-02",{"$f":"WEEKDAY(B3,1)","v":"1900-01-04"},{"$f":"IF(OR(C3=1,C3=7),\"Fin de semana\",\"\")","v":""},null,null,null,{"$f":"IF($G3-$E3=0,\"\",$G3-$E3-$F3)","v":""},null,null,null,{"$f":"IF(AND($D3<>\"Mañana y Tarde\",OR($I3<>\"\",$K3<>\"\")),\"El tipo de día debe ser Mañana y Tarde o no haber horas por la tarde\",IF($K3-$I3=0,\"\",$K3-$I3-$J3))","v":""}]
[40,"2019-10-03","1900-01-05",{"$f":"IF(OR(C4=1,C4=7),\"Fin de semana\",\"\")","v":""},null,null,null,"",null,null,null,""]
[40,"2019-10-04","1900-01-06","",null,null,null,"",null,null,null,""]
[40,"2019-10-05","1900-01-07","Fin de semana",null,null,null,"",null,null,null,""]
{"$rows_left_out":27}
{"sheet":"NOVIEMBRE","index":13,"n_rows":31,"n_cols":13,"rows_kept":31,"cut":false,"hidden":false,"merged":[]}
["SEMANA","Día","Día Semana","Tipo día","Entrada","Descanso","Salida","Total mañana","Entrada","Descanso","Salida","Total Tarde","Notas del día"]
[{"$f":"_xlfn.ISOWEEKNUM(B2)","v":44},"2019-11-01",{"$f":"WEEKDAY(B2,1)","v":"1900-01-06"},"Festivo",null,null,null,{"$f":"IF($G2-$E2=0,\"\",$G2-$E2-$F2)","v":""},null,null,null,{"$f":"IF(AND($D2<>\"Mañana y Tarde\",OR($I2<>\"\",$K2<>\"\")),\"El tipo de día debe ser Mañana y Tarde o no haber horas por la tarde\",IF($K2-$I2=0,\"\",$K2-$I2-$J2))","v":""}]
[{"$f":"_xlfn.ISOWEEKNUM(B3)","v":44},"2019-11-02",{"$f":"WEEKDAY(B3,1)","v":"1900-01-07"},{"$f":"IF(OR(C3=1,C3=7),\"Fin de semana\",\"\")","v":"Fin de semana"},null,null,null,{"$f":"IF($G3-$E3=0,\"\",$G3-$E3-$F3)","v":""},null,null,null,{"$f":"IF(AND($D3<>\"Mañana y Tarde\",OR($I3<>\"\",$K3<>\"\")),\"El tipo de día debe ser Mañana y Tarde o no haber horas por la tarde\",IF($K3-$I3=0,\"\",$K3-$I3-$J3))","v":""}]
[44,"2019-11-03","1900-01-01",{"$f":"IF(OR(C4=1,C4=7),\"Fin de semana\",\"\")","v":"Fin de semana"},null,null,null,"",null,null,null,""]
[45,"2019-11-04","1900-01-02","",null,null,null,"",null,null,null,""]
[45,"2019-11-05","1900-01-03","",null,null,null,"",null,null,null,""]
{"$rows_left_out":26}
{"sheet":"DICIEMBRE","index":14,"n_rows":32,"n_cols":13,"rows_kept":32,"cut":false,"hidden":false,"merged":[]}
["SEMANA","Día","Día Semana","Tipo día","Entrada","Descanso","Salida","Total mañana","Entrada","Descanso","Salida","Total Tarde","Notas del día"]
[{"$f":"_xlfn.ISOWEEKNUM(B2)","v":48},"2019-12-01",{"$f":"WEEKDAY(B2,1)","v":"1900-01-01"},{"$f":"IF(OR(C2=1,C2=7),\"Fin de semana\",\"\")","v":"Fin de semana"},null,null,null,{"$f":"IF($G2-$E2=0,\"\",$G2-$E2-$F2)","v":""},null,null,null,{"$f":"IF(AND($D2<>\"Mañana y Tarde\",OR($I2<>\"\",$K2<>\"\")),\"El tipo de día debe ser Mañana y Tarde o no haber horas por la tarde\",IF($K2-$I2=0,\"\",$K2-$I2-$J2))","v":""}]
[{"$f":"_xlfn.ISOWEEKNUM(B3)","v":49},"2019-12-02",{"$f":"WEEKDAY(B3,1)","v":"1900-01-02"},{"$f":"IF(OR(C3=1,C3=7),\"Fin de semana\",\"\")","v":""},null,null,null,{"$f":"IF($G3-$E3=0,\"\",$G3-$E3-$F3)","v":""},null,null,null,{"$f":"IF(AND($D3<>\"Mañana y Tarde\",OR($I3<>\"\",$K3<>\"\")),\"El tipo de día debe ser Mañana y Tarde o no haber horas por la tarde\",IF($K3-$I3=0,\"\",$K3-$I3-$J3))","v":""}]
[49,"2019-12-03","1900-01-03",{"$f":"IF(OR(C4=1,C4=7),\"Fin de semana\",\"\")","v":""},null,null,null,"",null,null,null,""]
[49,"2019-12-04","1900-01-04","",null,null,null,"",null,null,null,""]
[49,"2019-12-05","1900-01-05","",null,null,null,"",null,null,null,""]
{"$rows_left_out":26}