{"text_format":"1","workbook":"xlsx","n_sheets":15,"sheets":["Resumen","Valores","Calendario","ENERO","FEBRERO","MARZO","ABRIL","MAYO","JUNIO","JULIO","AGOSTO","SEPTIEMBRE","OCTUBRE","NOVIEMBRE","DICIEMBRE"],"not_rendered":{"charts":0,"images":4,"macros":1,"external_links":1,"defined_names":14,"comments":12,"pivot_tables":0},"unopened":[],"bounds":{"document_bytes":16777216,"sheet_cells":100000,"rows_first":2000,"rows_last":500,"rows_between":2000,"halvings":0,"cell_chars":16384,"cell_head_chars":4096},"cells_cut":0,"cells_raw":0,"read":"whole","date_system":"1900"}

{"sheet":"Resumen","index":0,"n_rows":75,"n_cols":19,"rows_kept":75,"cut":false,"hidden":false,"merged":[[12,16,12,17],[53,0,53,14],[46,0,46,14],[31,0,31,14],[12,8,12,14],[15,3,15,5],[14,3,14,5],[13,3,13,5],[12,3,12,5],[13,8,13,14],[14,8,14,14]]}
[]
[]
[]
[]
[]
[]
[]
[]
[]
[]
[]
[]
["Días Totales Año",365,null,"Horas totales",null,null,70,null,"ADVERTENCIAS",null,null,null,null,null,null,null,{"$f":"CONCATENATE(\"Semana en curso: \",_xlfn.ISOWEEKNUM(TODAY()))","v":"Semana en curso: 50"}]
["Sólo mañana",{"$f":"SUM(Valores!B2:M2)","v":0},null,"Horas realizadas",null,null,{"$f":"SUM(Valores!8:8)","v":0},null,{"$f":"IF(VLOOKUP(_xlfn.ISOWEEKNUM(TODAY()),Q15:R67,2,FALSE)<\"35,00\",CONCATENATE(\"ATENCIÓN Esta semana no has cumplido el mínimo de 35 horas aún. Te quedan por hacer \",35-VLOOKUP(_xlfn.ISOWEEKNUM(TODAY()),Q15:R67,2,FALSE),\" horas\"),IF(VLOOKUP(_xlfn.ISOWEEKNUM(TODAY()),Q15:R67,2,FALSE)<=\"42,00\",\"Ya has hecho esta semana las horas mínimas exigibles\",CONCATENATE(\"Te has excedido en \",VLOOKUP(_xlfn.ISOWEEKNUM(TODAY()),Q15:R67,2,FALSE)-42,\" horas esta semana que no cuentan para las 1680 horas anuales\")))","v":"ATENCIÓN Esta semana no has cumplido el mínimo de 35 horas aún. Te quedan por hacer 35 horas"},null,null,null,null,null,null,null,"Semana","Horas"]
["Mañana y Tarde",{"$f":"SUM(Valores!B3:M3)","v":0},null,"Horas restantes",null,null,{"$f":"G13-G14","v":70},null,{"$f":"IF(Valores!O2<35,CONCATENATE(\"Este AÑO lleva realizadas de media MENOS de 35 horas semanales (Actual--> \",Valores!O2,\")\"),IF(Valores!O2>42,CONCATENATE(\"Has excedido la media semanal de 42 horas en lo que llevas de año (Actual--> \",Valores!F2,\")\"),\"\"))","v":"Este AÑO lleva realizadas de media MENOS de 35 horas semanales (Actual--> 0)"},null,null,null,null,null,null,null,1,{"$f":"TEXT(VLOOKUP(Q15,Valores!$A$10:$N$62,14,FALSE)*24,\"00,00\")","v":"00,00"},{"$f":"IF(YEAR(TODAY())=2017,IF(AND(R15<\"35,00\",Q15<=_xlfn.ISOWEEKNUM(TODAY())),\"Faltan horas para las 35 semanales\",IF(AND(R15>\"42,00\",Q15<=_xlfn.ISOWEEKNUM(TODAY())),\"Has excedido las 42 horas máximas\",\"\")),\"\")","v":""}]
["Fin de semana",{"$f":"SUM(Valores!B4:M4)","v":103},null,"Horas a realizar por día laborable restante",null,null,{"$f":"IF(B20=0,0,G15/B20)","v":0.27450980392156865},null,null,null,null,null,null,null,null,null,2,{"$f":"TEXT(VLOOKUP(Q16,Valores!$A$10:$N$62,14,FALSE)*24,\"00,00\")","v":"00,00"},{"$f":"IF(YEAR(TODAY())=2017,IF(AND(R16<\"35,00\",Q16<=_xlfn.ISOWEEKNUM(TODAY())),\"Faltan horas para las 35 semanales\",IF(AND(R16>\"42,00\",Q16<=_xlfn.ISOWEEKNUM(TODAY())),\"Has excedido las 42 horas máximas\",\"\")),\"\")","v":""}]
["Festivo",{"$f":"SUM(Valores!B5:M5)","v":7},null,null,null,null,null,null,null,null,null,null,null,null,null,null,3,{"$f":"TEXT(VLOOKUP(Q17,Valores!$A$10:$N$62,14,FALSE)*24,\"00,00\")","v":"00,00"},""]
["Vacaciones",{"$f":"SUM(Valores!B6:M6)","v":0},null,"Mes","Horas","Tardes",null,null,null,null,null,null,null,null,null,null,4,{"$f":"TEXT(VLOOKUP(Q18,Valores!$A$10:$N$62,14,FALSE)*24,\"00,00\")","v":"00,00"},""]
["IT,Permiso reglam.",{"$f":"SUM(Valores!B7:M7)","v":0},null,"ENERO",{"$f":"TEXT(Valores!$B$8*24,\"0,00\")","v":"0,00"},{"$f":"Valores!$B$3","v":0},null,null,null,null,null,null,null,null,null,null,5,{"$f":"TEXT(VLOOKUP(Q19,Valores!$A$10:$N$62,14,FALSE)*24,\"00,00\")","v":"00,00"},""]
["Días laborales restantes",{"$f":"B13-SUM(B14:B19)","v":255},null,"FEBRERO",{"$f":"TEXT(Valores!$C$8*24,\"0,00\")","v":"0,00"},{"$f":"Valores!$C$3","v":0},null,null,null,null,null,null,null,null,null,null,6,{"$f":"TEXT(VLOOKUP(Q20,Valores!$A$10:$N$62,14,FALSE)*24,\"00,00\")","v":"00,00"},""]
["Tardes restantes mínimas",{"$f":"IF(100-B15<0,0,100-B15)","v":100},null,"MARZO",{"$f":"TEXT(Valores!$D$8*24,\"0,00\")","v":"0,00"},{"$f":"Valores!$D$3","v":0},null,null,null,null,null,null,null,null,null,null,7,{"$f":"TEXT(VLOOKUP(Q21,Valores!$A$10:$N$62,14,FALSE)*24,\"00,00\")","v":"00,00"},""]
["Tardes/Días laborables restantes",{"$f":"IF(B20=0,\"\",B21/B20)","v":0.39215686274509803},null,"ABRIL",{"$f":"TEXT(Valores!$E$8*24,\"0,00\")","v":"0,00"},{"$f":"Valores!$E$3","v":0},null,null,null,null,null,null,null,null,null,null,8,{"$f":"TEXT(VLOOKUP(Q22,Valores!$A$10:$N$62,14,FALSE)*24,\"00,00\")","v":"00,00"},""]
[null,null,null,"MAYO",{"$f":"TEXT(Valores!$F$8*24,\"0,00\")","v":"0,00"},{"$f":"Valores!$F$3","v":0},null,null,null,null,null,null,null,null,null,null,9,{"$f":"TEXT(VLOOKUP(Q23,Valores!$A$10:$N$62,14,FALSE)*24,\"00,00\")","v":"00,00"},""]
[null,null,null,"JUNIO",{"$f":"TEXT(Valores!$G$8*24,\"0,00\")","v":"0,00"},{"$f":"Valores!$G$3","v":0},null,null,null,null,null,null,null,null,null,null,10,{"$f":"TEXT(VLOOKUP(Q24,Valores!$A$10:$N$62,14,FALSE)*24,\"00,00\")","v":"00,00"},""]
[null,null,null,"JULIO",{"$f":"TEXT(Valores!$H$8*24,\"0,00\")","v":"0,00"},{"$f":"Valores!$H$3","v":0},null,null,null,null,null,null,null,null,null,null,11,{"$f":"TEXT(VLOOKUP(Q25,Valores!$A$10:$N$62,14,FALSE)*24,\"00,00\")","v":"00,00"},""]
[null,null,null,"AGOSTO",{"$f":"TEXT(Valores!$I$8*24,\"0,00\")","v":"0,00"},{"$f":"Valores!$I$3","v":0},null,null,null,null,null,null,null,null,null,null,12,{"$f":"TEXT(VLOOKUP(Q26,Valores!$A$10:$N$62,14,FALSE)*24,\"00,00\")","v":"00,00"},""]
[null,null,null,"SEPTIEMBRE",{"$f":"TEXT(Valores!$J$8*24,\"0,00\")","v":"0,00"},{"$f":"Valores!$J$3","v":0},null,null,null,null,null,null,null,null,null,null,13,{"$f":"TEXT(VLOOKUP(Q27,Valores!$A$10:$N$62,14,FALSE)*24,\"00,00\")","v":"00,00"},""]
[null,null,null,"OCTUBRE",{"$f":"TEXT(Valores!$K$8*24,\"0,00\")","v":"0,00"},{"$f":"Valores!$K$3","v":0},null,null,null,null,null,null,null,null,null,null,14,{"$f":"TEXT(VLOOKUP(Q28,Valores!$A$10:$N$62,14,FALSE)*24,\"00,00\")","v":"00,00"},""]
[null,null,null,"NOVIEMBRE",{"$f":"TEXT(Valores!$L$8*24,\"0,00\")","v":"0,00"},{"$f":"Valores!$L$3","v":0},null,null,null,null,null,null,null,null,null,null,15,{"$f":"TEXT(VLOOKUP(Q29,Valores!$A$10:$N$62,14,FALSE)*24,\"00,00\")","v":"00,00"},""]
["V.1.5 para el año 2019",null,null,"DICIEMBRE",{"$f":"TEXT(Valores!$M$8*24,\"0,00\")","v":"0,00"},{"$f":"Valores!$M$3","v":0},null,null,null,null,null,null,null,null,null,null,16,{"$f":"TEXT(VLOOKUP(Q30,Valores!$A$10:$N$62,14,FALSE)*24,\"00,00\")","v":"00,00"},""]
[null,null,null,null,null,null,null,null,null,null,null,null,null,null,null,null,17,{"$f":"TEXT(VLOOKUP(Q31,Valores!$A$10:$N$62,14,FALSE)*24,\"00,00\")","v":"00,00"},""]
["INSTRUCCIONES DE USO",null,null,null,null,null,null,null,null,null,null,null,null,null,null,null,18,{"$f":"TEXT(VLOOKUP(Q32,Valores!$A$10:$N$62,14,FALSE)*24,\"00,00\")","v":"00,00"},""]
["1.- En la columna \"Tipo día\" hay que seleccionar que tipo de día es en el desplegable, si trabajamos por la tarde hay que poner \"Mañana y Tarde\" y si solo vamos por la mañana, seleccionamos \"Mañana\"",null,null,null,null,null,null,null,null,null,null,null,null,null,null,null,19,{"$f":"TEXT(VLOOKUP(Q33,Valores!$A$10:$N$62,14,FALSE)*24,\"00,00\")","v":"00,00"},""]
["      Los fines de semana se seleccionan solos, pero si lo cambiamos por error, sólo hay que volver a seleccionarlo como tal",null,null,null,null,null,null,null,null,null,null,null,null,null,null,null,20,{"$f":"TEXT(VLOOKUP(Q34,Valores!$A$10:$N$62,14,FALSE)*24,\"00,00\")","v":"00,00"},""]
["      Los festivos tendremos que seleccionarlos al ser distintos en cada población. Puedes ver cuales te tocan en nuestro calendario en nuestra página web www.satebankia.org",null,null,null,null,null,null,null,null,null,null,null,null,null,null,null,21,{"$f":"TEXT(VLOOKUP(Q35,Valores!$A$10:$N$62,14,FALSE)*24,\"00,00\")","v":"00,00"},""]
["2.-  En la columnas Entrada y Salida pondremos las horas a las que realizamos ambas, tanto por la mañana como por la tarde, esta última sólo si la hacemos",null,null,null,null,null,null,null,null,null,null,null,null,null,null,null,22,{"$f":"TEXT(VLOOKUP(Q36,Valores!$A$10:$N$62,14,FALSE)*24,\"00,00\")","v":"00,00"},""]
["       Recuerda que para que cuente la tarde, has de hacer un mínimo de 2 horas",null,null,null,null,null,null,null,null,null,null,null,null,null,null,null,23,{"$f":"TEXT(VLOOKUP(Q37,Valores!$A$10:$N$62,14,FALSE)*24,\"00,00\")","v":"00,00"},""]
["       Entre las columnas que hay entre Entrada y Salida, hay otra columna llamada Descanso. Has de poner el tiempo que has parado para el desayuno/almuerzo",null,null,null,null,null,null,null,null,null,null,null,null,null,null,null,24,{"$f":"TEXT(VLOOKUP(Q38,Valores!$A$10:$N$62,14,FALSE)*24,\"00,00\")","v":"00,00"},""]
["       IMPORTANTE: Si haces menos de 2 horas y seleccionas en \"Tipo día\"-->\"Mañana y Tarde\", la aplicación te contará como tarde realizada, aunque Bankia no lo hará",null,null,null,null,null,null,null,null,null,null,null,null,null,null,null,25,{"$f":"TEXT(VLOOKUP(Q39,Valores!$A$10:$N$62,14,FALSE)*24,\"00,00\")","v":"00,00"},""]
["       Si haces menos de 2 horas una tarde, añade las horas a la salida de la mañana para que se computen en la columna \"Total mañana\"",null,null,null,null,null,null,null,null,null,null,null,null,null,null,null,26,{"$f":"TEXT(VLOOKUP(Q40,Valores!$A$10:$N$62,14,FALSE)*24,\"00,00\")","v":"00,00"},""]
["3.- En esta hoja, la celda \"Tardes restantes mínimas\" son las tardes que te quedan por hacer en el año",null,null,null,null,null,null,null,null,null,null,null,null,null,null,null,27,{"$f":"TEXT(VLOOKUP(Q41,Valores!$A$10:$N$62,14,FALSE)*24,\"00,00\")","v":"00,00"},""]
["      Tambien en esta hoja, la celda \"Tardes/Días laborables restantes\" es una simple división de las tardes restantes por los días que quedan por trabajar.  Para que funcione bien, deberías haber",null,null,null,null,null,null,null,null,null,null,null,null,null,null,null,28,{"$f":"TEXT(VLOOKUP(Q42,Valores!$A$10:$N$62,14,FALSE)*24,\"00,00\")","v":"00,00"},""]
["      puesto previamente los días festivos de tu localidad",null,null,null,null,null,null,null,null,null,null,null,null,null,null,null,29,{"$f":"TEXT(VLOOKUP(Q43,Valores!$A$10:$N$62,14,FALSE)*24,\"00,00\")","v":"00,00"},""]
["      Lo anterior también es aplicable a la celda \"Horas a realizar por día laborable restante\".",null,null,null,null,null,null,null,null,null,null,null,null,null,null,null,30,{"$f":"TEXT(VLOOKUP(Q44,Valores!$A$10:$N$62,14,FALSE)*24,\"00,00\")","v":"00,00"},""]
["4.- En definitiva, SÓLO debes modificar las columnas que estén en GRIS en las hojas de los meses.",null,null,null,null,null,null,null,null,null,null,null,null,null,null,null,31,{"$f":"TEXT(VLOOKUP(Q45,Valores!$A$10:$N$62,14,FALSE)*24,\"00,00\")","v":"00,00"},""]
[null,null,null,null,null,null,null,null,null,null,null,null,null,null,null,null,32,{"$f":"TEXT(VLOOKUP(Q46,Valores!$A$10:$N$62,14,FALSE)*24,\"00,00\")","v":"00,00"},""]
["GUÍA PARA COMPLETAR LAS 100 TARDES Y LAS 1680 HORAS",null,null,null,null,null,null,null,null,null,null,null,null,null,null,null,33,{"$f":"TEXT(VLOOKUP(Q47,Valores!$A$10:$N$62,14,FALSE)*24,\"00,00\")","v":"00,00"},""]
["1.- Para completar las 100 tardes, quitando vacaciones y haciendo horario de solo mañana 1 mes en verano, Navidad, Pascua y Fiestas Patronales, la media es de 3 tardes a la semana.",null,null,null,null,null,null,null,null,null,null,null,null,null,null,null,34,{"$f":"TEXT(VLOOKUP(Q48,Valores!$A$10:$N$62,14,FALSE)*24,\"00,00\")","v":"00,00"},""]
["2.- Para completar las MÍNIMAS horas exigibles, debes hacer de media semanal anual entre 35 y 42 horas. Si una semana no llegas al mínimo, puedes compensar con las siguientes, teniendo en cuenta no superar las 1680 horas anuales",null,null,null,null,null,null,null,null,null,null,null,null,null,null,null,35,{"$f":"TEXT(VLOOKUP(Q49,Valores!$A$10:$N$62,14,FALSE)*24,\"00,00\")","v":"00,00"},""]
["3.- Recuerda que el horario DEBE ser consensuado con el Director de la oficina y NO PUEDES hacer el horario que quieras sin consultarlo previamente.",null,null,null,null,null,null,null,null,null,null,null,null,null,null,null,36,{"$f":"TEXT(VLOOKUP(Q50,Valores!$A$10:$N$62,14,FALSE)*24,\"00,00\")","v":"00,00"},""]
["4.- El horario de Convenio deja de ser válido, por lo que NO ES OBLIGATORIO hacer la tarde de los jueves, aunque por necesidades del servicio pueden no dejarte librarlo.",null,null,null,null,null,null,null,null,null,null,null,null,null,null,null,37,{"$f":"TEXT(VLOOKUP(Q51,Valores!$A$10:$N$62,14,FALSE)*24,\"00,00\")","v":"00,00"},""]
[null,null,null,null,null,null,null,null,null,null,null,null,null,null,null,null,38,{"$f":"TEXT(VLOOKUP(Q52,Valores!$A$10:$N$62,14,FALSE)*24,\"00,00\")","v":"00,00"},""]
[null,null,null,null,null,null,null,null,null,null,null,null,null,null,null,null,39,{"$f":"TEXT(VLOOKUP(Q53,Valores!$A$10:$N$62,14,FALSE)*24,\"00,00\")","v":"00,00"},""]
["FESTIVOS 2018",null,null,null,null,null,null,null,null,null,null,null,null,null,null,null,40,{"$f":"TEXT(VLOOKUP(Q54,Valores!$A$10:$N$62,14,FALSE)*24,\"00,00\")","v":"00,00"},""]
["Nacionales: 1 de enero; 19 de abril; 1 de mayo; 15 de agosto; 12 de octubre; 1 de noviembre; 6 y 25 de diciembre",null,null,null,null,null,null,null,null,null,null,null,null,null,null,null,41,{"$f":"TEXT(VLOOKUP(Q55,Valores!$A$10:$N$62,14,FALSE)*24,\"00,00\")","v":"00,00"},""]
["ANDALUCIA: 7 de enero, 28 de febrero, 18 y 19 de abril y 9 de diciembre",null,null,null,null,null,null,null,null,null,null,null,null,null,null,null,42,{"$f":"TEXT(VLOOKUP(Q56,Valores!$A$10:$N$62,14,FALSE)*24,\"00,00\")","v":"00,00"},""]
["ARAGON: 7 de enero, 18, 19 y 23 de abril y 9 de diciembre",null,null,null,null,null,null,null,null,null,null,null,null,null,null,null,43,{"$f":"TEXT(VLOOKUP(Q57,Valores!$A$10:$N$62,14,FALSE)*24,\"00,00\")","v":"00,00"},""]
["ASTURIAS: 7 de enero, 18 y 19 de abril, 9 de septiembre y 9 de diciembre",null,null,null,null,null,null,null,null,null,null,null,null,null,null,null,44,{"$f":"TEXT(VLOOKUP(Q58,Valores!$A$10:$N$62,14,FALSE)*24,\"00,00\")","v":"00,00"},""]
["BALEARES: 1 de marzo, 18, 19 y 22 de abril y 26 de diciembre",null,null,null,null,null,null,null,null,null,null,null,null,null,null,null,45,{"$f":"TEXT(VLOOKUP(Q59,Valores!$A$10:$N$62,14,FALSE)*24,\"00,00\")","v":"00,00"},""]
["CANARIAS: 7 de enero, 18 y 19 de abril, 30 de mayo y festivos insulares",null,null,null,null,null,null,null,null,null,null,null,null,null,null,null,46,{"$f":"TEXT(VLOOKUP(Q60,Valores!$A$10:$N$62,14,FALSE)*24,\"00,00\")","v":"00,00"},""]
["CANTABRIA: 18, 19 y 22 de abril, 25 de julio y 9 de diciembre",null,null,null,null,null,null,null,null,null,null,null,null,null,null,null,47,{"$f":"TEXT(VLOOKUP(Q61,Valores!$A$10:$N$62,14,FALSE)*24,\"00,00\")","v":"00,00"},""]
["CASTILLA LA MANCHA: 18, 19 y 22 de abril, 31 de mayo y 20 de junio",null,null,null,null,null,null,null,null,null,null,null,null,null,null,null,48,{"$f":"TEXT(VLOOKUP(Q62,Valores!$A$10:$N$62,14,FALSE)*24,\"00,00\")","v":"00,00"},""]
["CASTILLA Y LEON: 7 de enero, 18, 19 y 23 de abril y 9 de diciembre",null,null,null,null,null,null,null,null,null,null,null,null,null,null,null,49,{"$f":"TEXT(VLOOKUP(Q63,Valores!$A$10:$N$62,14,FALSE)*24,\"00,00\")","v":"00,00"},""]
["CATALUÑA: 19 y 22 de abril, 24 de junio, 11 de septiembre y 26 de diciembre",null,null,null,null,null,null,null,null,null,null,null,null,null,null,null,50,{"$f":"TEXT(VLOOKUP(Q64,Valores!$A$10:$N$62,14,FALSE)*24,\"00,00\")","v":"00,00"},""]
["COM.VALENCIANA: 19 de marzo, 19 y 22 de abril, 24 de junio y 9 de octubre",null,null,null,null,null,null,null,null,null,null,null,null,null,null,null,51,{"$f":"TEXT(VLOOKUP(Q65,Valores!$A$10:$N$62,14,FALSE)*24,\"00,00\")","v":"00,00"},""]
["EXTREMADURA: 7 de enero, 18 y 19 de abril, 9 de septiembre y 9 de diciembre",null,null,null,null,null,null,null,null,null,null,null,null,null,null,null,52,{"$f":"TEXT(VLOOKUP(Q66,Valores!$A$10:$N$62,14,FALSE)*24,\"00,00\")","v":"00,00"},{"$f":"IF(YEAR(TODAY())=2017,IF(AND(R67<\"35,00\",Q67<=_xlfn.ISOWEEKNUM(TODAY())),\"Faltan horas para las 35 semanales\",IF(AND(R67>\"42,00\",Q67<=_xlfn.ISOWEEKNUM(TODAY())),\"Has excedido las 42 horas máximas\",\"\")),\"\")","v":""}]
["GALICIA: 19 de marzo, 18 y 19 de abril, 17 de mayo y 25 de julio",null,null,null,null,null,null,null,null,null,null,null,null,null,null,null,53,{"$f":"TEXT(VLOOKUP(Q67,Valores!$A$10:$N$62,14,FALSE)*24,\"00,00\")","v":"00,00"}]
["LA RIOJA: 18, 19 y 22 de abril, 10 de junio y 9 de diciembre"]
["MADRID: 7 de enero, 18 y 19 de abril, 2 de mayo y 9 de diciembre"]
["MURCIA: 7 de enero, 19 de marzo, 18 y 19 de abril y 10 de junio"]
["NAVARRA: 7 de enero, 19 de marzo y 18, 19 y 22 de abril"]
["PAIS VASCO: 19 de marzo, 18, 19 y 22 de abril y 25 de julio"]
["FESTIVOS LOCALES: A estos festivos, hay que añadirles 2 festivos locales a elección del municipio"]
[]
["Si te da error al abrir la hoja de cálculo, ten en cuenta que es necesario aceptar los dos mensajes que abajo te indicamos. Si no lo haces la hoja no funcionará adecuadamente."]

{"sheet":"Valores","index":1,"n_rows":62,"n_cols":15,"rows_kept":62,"cut":false,"hidden":true,"merged":[]}
["Tipo día","Enero","Febrero","Marzo","Abril","Mayo","Junio","Julio","Agosto","Septiembre","Octubre","Noviembre","Diciembre",null,"Media semanal horas"]
["Sólo mañana",{"$f":"COUNTIF(ENERO!$D$2:$D$32,Valores!$A2)","v":0},{"$f":"COUNTIF(FEBRERO!$D$2:$D$32,Valores!$A2)","v":0},{"$f":"COUNTIF(MARZO!$D$2:$D$32,Valores!$A2)","v":0},{"$f":"COUNTIF(ABRIL!$D$2:$D$32,Valores!$A2)","v":0},{"$f":"COUNTIF(MAYO!$D$2:$D$32,Valores!$A2)","v":0},{"$f":"COUNTIF(JUNIO!$D$2:$D$32,Valores!$A2)","v":0},{"$f":"COUNTIF(JULIO!$D$2:$D$32,Valores!$A2)","v":0},{"$f":"COUNTIF(AGOSTO!$D$2:$D$32,Valores!$A2)","v":0},{"$f":"COUNTIF(SEPTIEMBRE!$D$2:$D$32,Valores!$A2)","v":0},{"$f":"COUNTIF(OCTUBRE!$D$2:$D$32,Valores!$A2)","v":0},{"$f":"COUNTIF(NOVIEMBRE!$D$2:$D$32,Valores!$A2)","v":0},{"$f":"COUNTIF(DICIEMBRE!$D$2:$D$32,Valores!$A2)","v":0},null,{"$f":"IF(SUM(B2:M3)=0,0,TEXT((SUM(B8:M8)*24),\"0,00\")/(SUM(B2:M3)/5))","v":0}]
["Mañana y Tarde",{"$f":"COUNTIF(ENERO!$D$2:$D$32,Valores!$A3)","v":0},{"$f":"COUNTIF(FEBRERO!$D$2:$D$32,Valores!$A3)","v":0},{"$f":"COUNTIF(MARZO!$D$2:$D$32,Valores!$A3)","v":0},{"$f":"COUNTIF(ABRIL!$D$2:$D$32,Valores!$A3)","v":0},{"$f":"COUNTIF(MAYO!$D$2:$D$32,Valores!$A3)","v":0},{"$f":"COUNTIF(JUNIO!$D$2:$D$32,Valores!$A3)","v":0},{"$f":"COUNTIF(JULIO!$D$2:$D$32,Valores!$A3)","v":0},{"$f":"COUNTIF(AGOSTO!$D$2:$D$32,Valores!$A3)","v":0},{"$f":"COUNTIF(SEPTIEMBRE!$D$2:$D$32,Valores!$A3)","v":0},{"$f":"COUNTIF(OCTUBRE!$D$2:$D$32,Valores!$A3)","v":0},{"$f":"COUNTIF(NOVIEMBRE!$D$2:$D$32,Valores!$A3)","v":0},{"$f":"COUNTIF(DICIEMBRE!$D$2:$D$32,Valores!$A3)","v":0}]
["Fin de semana",{"$f":"COUNTIF(ENERO!$D$2:$D$32,Valores!$A4)","v":8},{"$f":"COUNTIF(FEBRERO!$D$2:$D$32,Valores!$A4)","v":8},{"$f":"COUNTIF(MARZO!$D$2:$D$32,Valores!$A4)","v":10},{"$f":"COUNTIF(ABRIL!$D$2:$D$32,Valores!$A4)","v":8},{"$f":"COUNTIF(MAYO!$D$2:$D$32,Valores!$A4)","v":8},{"$f":"COUNTIF(JUNIO!$D$2:$D$32,Valores!$A4)","v":10},{"$f":"COUNTIF(JULIO!$D$2:$D$32,Valores!$A4)","v":8},{"$f":"COUNTIF(AGOSTO!$D$2:$D$32,Valores!$A4)","v":9},{"$f":"COUNTIF(SEPTIEMBRE!$D$2:$D$32,Valores!$A4)","v":9},{"$f":"COUNTIF(OCTUBRE!$D$2:$D$32,Valores!$A4)","v":7},{"$f":"COUNTIF(NOVIEMBRE!$D$2:$D$32,Valores!$A4)","v":9},{"$f":"COUNTIF(DICIEMBRE!$D$2:$D$32,Valores!$A4)","v":9}]
["Festivo",{"$f":"COUNTIF(ENERO!$D$2:$D$32,Valores!$A5)","v":1},{"$f":"COUNTIF(FEBRERO!$D$2:$D$32,Valores!$A5)","v":0},{"$f":"COUNTIF(MARZO!$D$2:$D$32,Valores!$A5)","v":0},{"$f":"COUNTIF(ABRIL!$D$2:$D$32,Valores!$A5)","v":0},{"$f":"COUNTIF(MAYO!$D$2:$D$32,Valores!$A5)","v":1},{"$f":"COUNTIF(JUNIO!$D$2:$D$32,Valores!$A5)","v":0},{"$f":"COUNTIF(JULIO!$D$2:$D$32,Valores!$A5)","v":0},{"$f":"COUNTIF(AGOSTO!$D$2:$D$32,Valores!$A5)","v":1},{"$f":"COUNTIF(SEPTIEMBRE!$D$2:$D$32,Valores!$A5)","v":0},{"$f":"COUNTIF(OCTUBRE!$D$2:$D$32,Valores!$A5)","v":1},{"$f":"COUNTIF(NOVIEMBRE!$D$2:$D$32,Valores!$A5)","v":1},{"$f":"COUNTIF(DICIEMBRE!$D$2:$D$32,Valores!$A5)","v":2}]
["Vacaciones",{"$f":"COUNTIF(ENERO!$D$2:$D$32,Valores!$A6)","v":0},{"$f":"COUNTIF(FEBRERO!$D$2:$D$32,Valores!$A6)","v":0},{"$f":"COUNTIF(MARZO!$D$2:$D$32,Valores!$A6)","v":0},{"$f":"COUNTIF(ABRIL!$D$2:$D$32,Valores!$A6)","v":0},{"$f":"COUNTIF(MAYO!$D$2:$D$32,Valores!$A6)","v":0},{"$f":"COUNTIF(JUNIO!$D$2:$D$32,Valores!$A6)","v":0},{"$f":"COUNTIF(JULIO!$D$2:$D$32,Valores!$A6)","v":0},{"$f":"COUNTIF(AGOSTO!$D$2:$D$32,Valores!$A6)","v":0},{"$f":"COUNTIF(SEPTIEMBRE!$D$2:$D$32,Valores!$A6)","v":0},{"$f":"COUNTIF(OCTUBRE!$D$2:$D$32,Valores!$A6)","v":0},{"$f":"COUNTIF(NOVIEMBRE!$D$2:$D$32,Valores!$A6)","v":0},{"$f":"COUNTIF(DICIEMBRE!$D$2:$D$32,Valores!$A6)","v":0}]
["IT,Permiso reglam.",{"$f":"COUNTIF(ENERO!$D$2:$D$32,Valores!$A7)","v":0},{"$f":"COUNTIF(FEBRERO!$D$2:$D$32,Valores!$A7)","v":0},{"$f":"COUNTIF(MARZO!$D$2:$D$32,Valores!$A7)","v":0},{"$f":"COUNTIF(ABRIL!$D$2:$D$32,Valores!$A7)","v":0},{"$f":"COUNTIF(MAYO!$D$2:$D$32,Valores!$A7)","v":0},{"$f":"COUNTIF(JUNIO!$D$2:$D$32,Valores!$A7)","v":0},{"$f":"COUNTIF(JULIO!$D$2:$D$32,Valores!$A7)","v":0},{"$f":"COUNTIF(AGOSTO!$D$2:$D$32,Valores!$A7)","v":0},{"$f":"COUNTIF(SEPTIEMBRE!$D$2:$D$32,Valores!$A7)","v":0},{"$f":"COUNTIF(OCTUBRE!$D$2:$D$32,Valores!$A7)","v":0},{"$f":"COUNTIF(NOVIEMBRE!$D$2:$D$32,Valores!$A7)","v":0},{"$f":"COUNTIF(DICIEMBRE!$D$2:$D$32,Valores!$A7)","v":0}]
["Horas realizadas",{"$f":"SUM(ENERO!$H:$H)+SUM(ENERO!$L:$L)","v":0},{"$f":"SUM(FEBRERO!$H:$H)+SUM(FEBRERO!$L:$L)","v":0},{"$f":"SUM(MARZO!$H:$H)+SUM(MARZO!$L:$L)","v":0},{"$f":"SUM(ABRIL!$H:$H)+SUM(ABRIL!$L:$L)","v":0},{"$f":"SUM(MAYO!$H:$H)+SUM(MAYO!$L:$L)","v":0},{"$f":"SUM(JUNIO!$H:$H)+SUM(JUNIO!$L:$L)","v":0},{"$f":"SUM(JULIO!$H:$H)+SUM(JULIO!$L:$L)","v":0},{"$f":"SUM(AGOSTO!$H:$H)+SUM(AGOSTO!$L:$L)","v":0},{"$f":"SUM(SEPTIEMBRE!$H:$H)+SUM(SEPTIEMBRE!$L:$L)","v":0},{"$f":"SUM(OCTUBRE!$H:$H)+SUM(OCTUBRE!$L:$L)","v":0},{"$f":"SUM(NOVIEMBRE!$H:$H)+SUM(NOVIEMBRE!$L:$L)","v":0},{"$f":"SUM(DICIEMBRE!$H:$H)+SUM(DICIEMBRE!$L:$L)","v":0}]
["Semana"]
[1,{"$f":"SUMIF(ENERO!$A$2:$A$32,Valores!$A10,ENERO!$H$2:$H$32)+SUMIF(ENERO!$A$2:$A$32,Valores!$A10,ENERO!$L$2:$L$32)","v":0},{"$f":"SUMIF(FEBRERO!$A$2:$A$32,Valores!$A10,FEBRERO!$H$2:$H$29)+SUMIF(FEBRERO!$A$2:$A$32,Valores!$A10,FEBRERO!$L$2:$L$32)","v":0},{"$f":"SUMIF(MARZO!$A$2:$A$32,Valores!$A10,MARZO!$H$2:$H$32)+SUMIF(MARZO!$A$2:$A$32,Valores!$A10,MARZO!$L$2:$L$32)","v":0},{"$f":"SUMIF(ABRIL!$A$2:$A$32,Valores!$A10,ABRIL!$H$2:$H$31)+SUMIF(ABRIL!$A$2:$A$32,Valores!$A10,ABRIL!$L$2:$L$32)","v":0},{"$f":"SUMIF(MAYO!$A$2:$A$32,Valores!$A10,MAYO!$H$2:$H$32)+SUMIF(MAYO!$A$2:$A$32,Valores!$A10,MAYO!$L$2:$L$32)","v":0},{"$f":"SUMIF(JUNIO!$A$2:$A$32,Valores!$A10,JUNIO!$H$2:$H$31)+SUMIF(JUNIO!$A$2:$A$32,Valores!$A10,JUNIO!$L$2:$L$32)","v":0},{"$f":"SUMIF(JULIO!$A$2:$A$32,Valores!$A10,JULIO!$H$2:$H$32)+SUMIF(JULIO!$A$2:$A$32,Valores!$A10,JULIO!$L$2:$L$32)","v":0},{"$f":"SUMIF(AGOSTO!$A$2:$A$32,Valores!$A10,AGOSTO!$H$2:$H$32)+SUMIF(AGOSTO!$A$2:$A$32,Valores!$A10,AGOSTO!$L$2:$L$32)","v":0},{"$f":"SUMIF(SEPTIEMBRE!$A$2:$A$32,Valores!$A10,SEPTIEMBRE!$H$2:$H$31)+SUMIF(SEPTIEMBRE!$A$2:$A$32,Valores!$A10,SEPTIEMBRE!$L$2:$L$32)","v":0},{"$f":"SUMIF(OCTUBRE!$A$2:$A$32,Valores!$A10,OCTUBRE!$H$2:$H$32)+SUMIF(OCTUBRE!$A$2:$A$32,Valores!$A10,OCTUBRE!$L$2:$L$32)","v":0},{"$f":"SUMIF(NOVIEMBRE!$A$2:$A$32,Valores!$A10,NOVIEMBRE!$H$2:$H$31)+SUMIF(NOVIEMBRE!$A$2:$A$32,Valores!$A10,NOVIEMBRE!$L$2:$L$32)","v":0},{"$f":"SUMIF(DICIEMBRE!$A$2:$A$32,Valores!$A10,DICIEMBRE!$H$2:$H$32)+SUMIF(DICIEMBRE!$A$2:$A$32,Valores!$A10,DICIEMBRE!$L$2:$L$32)","v":0},{"$f":"SUM(B10:M10)","v":0}]
[2,{"$f":"SUMIF(ENERO!$A$2:$A$32,Valores!$A11,ENERO!$H$2:$H$32)+SUMIF(ENERO!$A$2:$A$32,Valores!$A11,ENERO!$L$2:$L$32)","v":0},{"$f":"SUMIF(FEBRERO!$A$2:$A$32,Valores!$A11,FEBRERO!$H$2:$H$29)+SUMIF(FEBRERO!$A$2:$A$32,Valores!$A11,FEBRERO!$L$2:$L$32)","v":0},{"$f":"SUMIF(MARZO!$A$2:$A$32,Valores!$A11,MARZO!$H$2:$H$32)+SUMIF(MARZO!$A$2:$A$32,Valores!$A11,MARZO!$L$2:$L$32)","v":0},{"$f":"SUMIF(ABRIL!$A$2:$A$32,Valores!$A11,ABRIL!$H$2:$H$31)+SUMIF(ABRIL!$A$2:$A$32,Valores!$A11,ABRIL!$L$2:$L$32)","v":0},{"$f":"SUMIF(MAYO!$A$2:$A$32,Valores!$A11,MAYO!$H$2:$H$32)+SUMIF(MAYO!$A$2:$A$32,Valores!$A11,MAYO!$L$2:$L$32)","v":0},{"$f":"SUMIF(JUNIO!$A$2:$A$32,Valores!$A11,JUNIO!$H$2:$H$31)+SUMIF(JUNIO!$A$2:$A$32,Valores!$A11,JUNIO!$L$2:$L$32)","v":0},{"$f":"SUMIF(JULIO!$A$2:$A$32,Valores!$A11,JULIO!$H$2:$H$32)+SUMIF(JULIO!$A$2:$A$32,Valores!$A11,JULIO!$L$2:$L$32)","v":0},{"$f":"SUMIF(AGOSTO!$A$2:$A$32,Valores!$A11,AGOSTO!$H$2:$H$32)+SUMIF(AGOSTO!$A$2:$A$32,Valores!$A11,AGOSTO!$L$2:$L$32)","v":0},{"$f":"SUMIF(SEPTIEMBRE!$A$2:$A$32,Valores!$A11,SEPTIEMBRE!$H$2:$H$31)+SUMIF(SEPTIEMBRE!$A$2:$A$32,Valores!$A11,SEPTIEMBRE!$L$2:$L$32)","v":0},{"$f":"SUMIF(OCTUBRE!$A$2:$A$32,Valores!$A11,OCTUBRE!$H$2:$H$32)+SUMIF(OCTUBRE!$A$2:$A$32,Valores!$A11,OCTUBRE!$L$2:$L$32)","v":0},{"$f":"SUMIF(NOVIEMBRE!$A$2:$A$32,Valores!$A11,NOVIEMBRE!$H$2:$H$31)+SUMIF(NOVIEMBRE!$A$2:$A$32,Valores!$A11,NOVIEMBRE!$L$2:$L$32)","v":0},{"$f":"SUMIF(DICIEMBRE!$A$2:$A$32,Valores!$A11,DICIEMBRE!$H$2:$H$32)+SUMIF(DICIEMBRE!$A$2:$A$32,Valores!$A11,DICIEMBRE!$L$2:$L$32)","v":0},{"$f":"SUM(B11:M11)","v":0}]
[3,{"$f":"SUMIF(ENERO!$A$2:$A$32,Valores!$A12,ENERO!$H$2:$H$32)+SUMIF(ENERO!$A$2:$A$32,Valores!$A12,ENERO!$L$2:$L$32)","v":0},{"$f":"SUMIF(FEBRERO!$A$2:$A$32,Valores!$A12,FEBRERO!$H$2:$H$29)+SUMIF(FEBRERO!$A$2:$A$32,Valores!$A12,FEBRERO!$L$2:$L$32)","v":0},{"$f":"SUMIF(MARZO!$A$2:$A$32,Valores!$A12,MARZO!$H$2:$H$32)+SUMIF(MARZO!$A$2:$A$32,Valores!$A12,MARZO!$L$2:$L$32)","v":0},{"$f":"SUMIF(ABRIL!$A$2:$A$32,Valores!$A12,ABRIL!$H$2:$H$31)+SUMIF(ABRIL!$A$2:$A$32,Valores!$A12,ABRIL!$L$2:$L$32)","v":0},{"$f":"SUMIF(MAYO!$A$2:$A$32,Valores!$A12,MAYO!$H$2:$H$32)+SUMIF(MAYO!$A$2:$A$32,Valores!$A12,MAYO!$L$2:$L$32)","v":0},{"$f":"SUMIF(JUNIO!$A$2:$A$32,Valores!$A12,JUNIO!$H$2:$H$31)+SUMIF(JUNIO!$A$2:$A$32,Valores!$A12,JUNIO!$L$2:$L$32)","v":0},{"$f":"SUMIF(JULIO!$A$2:$A$32,Valores!$A12,JULIO!$H$2:$H$32)+SUMIF(JULIO!$A$2:$A$32,Valores!$A12,JULIO!$L$2:$L$32)","v":0},{"$f":"SUMIF(AGOSTO!$A$2:$A$32,Valores!$A12,AGOSTO!$H$2:$H$32)+SUMIF(AGOSTO!$A$2:$A$32,Valores!$A12,AGOSTO!$L$2:$L$32)","v":0},{"$f":"SUMIF(SEPTIEMBRE!$A$2:$A$32,Valores!$A12,SEPTIEMBRE!$H$2:$H$31)+SUMIF(SEPTIEMBRE!$A$2:$A$32,Valores!$A12,SEPTIEMBRE!$L$2:$L$32)","v":0},{"$f":"SUMIF(OCTUBRE!$A$2:$A$32,Valores!$A12,OCTUBRE!$H$2:$H$32)+SUMIF(OCTUBRE!$A$2:$A$32,Valores!$A12,OCTUBRE!$L$2:$L$32)","v":0},{"$f":"SUMIF(NOVIEMBRE!$A$2:$A$32,Valores!$A12,NOVIEMBRE!$H$2:$H$31)+SUMIF(NOVIEMBRE!$A$2:$A$32,Valores!$A12,NOVIEMBRE!$L$2:$L$32)","v":0},{"$f":"SUMIF(DICIEMBRE!$A$2:$A$32,Valores!$A12,DICIEMBRE!$H$2:$H$32)+SUMIF(DICIEMBRE!$A$2:$A$32,Valores!$A12,DICIEMBRE!$L$2:$L$32)","v":0},0]
[4,{"$f":"SUMIF(ENERO!$A$2:$A$32,Valores!$A13,ENERO!$H$2:$H$32)+SUMIF(ENERO!$A$2:$A$32,Valores!$A13,ENERO!$L$2:$L$32)","v":0},{"$f":"SUMIF(FEBRERO!$A$2:$A$32,Valores!$A13,FEBRERO!$H$2:$H$29)+SUMIF(FEBRERO!$A$2:$A$32,Valores!$A13,FEBRERO!$L$2:$L$32)","v":0},{"$f":"SUMIF(MARZO!$A$2:$A$32,Valores!$A13,MARZO!$H$2:$H$32)+SUMIF(MARZO!$A$2:$A$32,Valores!$A13,MARZO!$L$2:$L$32)","v":0},{"$f":"SUMIF(ABRIL!$A$2:$A$32,Valores!$A13,ABRIL!$H$2:$H$31)+SUMIF(ABRIL!$A$2:$A$32,Valores!$A13,ABRIL!$L$2:$L$32)","v":0},{"$f":"SUMIF(MAYO!$A$2:$A$32,Valores!$A13,MAYO!$H$2:$H$32)+SUMIF(MAYO!$A$2:$A$32,Valores!$A13,MAYO!$L$2:$L$32)","v":0},{"$f":"SUMIF(JUNIO!$A$2:$A$32,Valores!$A13,JUNIO!$H$2:$H$31)+SUMIF(JUNIO!$A$2:$A$32,Valores!$A13,JUNIO!$L$2:$L$32)","v":0},{"$f":"SUMIF(JULIO!$A$2:$A$32,Valores!$A13,JULIO!$H$2:$H$32)+SUMIF(JULIO!$A$2:$A$32,Valores!$A13,JULIO!$L$2:$L$32)","v":0},{"$f":"SUMIF(AGOSTO!$A$2:$A$32,Valores!$A13,AGOSTO!$H$2:$H$32)+SUMIF(AGOSTO!$A$2:$A$32,Valores!$A13,AGOSTO!$L$2:$L$32)","v":0},{"$f":"SUMIF(SEPTIEMBRE!$A$2:$A$32,Valores!$A13,SEPTIEMBRE!$H$2:$H$31)+SUMIF(SEPTIEMBRE!$A$2:$A$32,Valores!$A13,SEPTIEMBRE!$L$2:$L$32)","v":0},{"$f":"SUMIF(OCTUBRE!$A$2:$A$32,Valores!$A13,OCTUBRE!$H$2:$H$32)+SUMIF(OCTUBRE!$A$2:$A$32,Valores!$A13,OCTUBRE!$L$2:$L$32)","v":0},{"$f":"SUMIF(NOVIEMBRE!$A$2:$A$32,Valores!$A13,NOVIEMBRE!$H$2:$H$31)+SUMIF(NOVIEMBRE!$A$2:$A$32,Valores!$A13,NOVIEMBRE!$L$2:$L$32)","v":0},{"$f":"SUMIF(DICIEMBRE!$A$2:$A$32,Valores!$A13,DICIEMBRE!$H$2:$H$32)+SUMIF(DICIEMBRE!$A$2:$A$32,Valores!$A13,DICIEMBRE!$L$2:$L$32)","v":0},0]
[5,{"$f":"SUMIF(ENERO!$A$2:$A$32,Valores!$A14,ENERO!$H$2:$H$32)+SUMIF(ENERO!$A$2:$A$32,Valores!$A14,ENERO!$L$2:$L$32)","v":0},{"$f":"SUMIF(FEBRERO!$A$2:$A$32,Valores!$A14,FEBRERO!$H$2:$H$29)+SUMIF(FEBRERO!$A$2:$A$32,Valores!$A14,FEBRERO!$L$2:$L$32)","v":0},{"$f":"SUMIF(MARZO!$A$2:$A$32,Valores!$A14,MARZO!$H$2:$H$32)+SUMIF(MARZO!$A$2:$A$32,Valores!$A14,MARZO!$L$2:$L$32)","v":0},{"$f":"SUMIF(ABRIL!$A$2:$A$32,Valores!$A14,ABRIL!$H$2:$H$31)+SUMIF(ABRIL!$A$2:$A$32,Valores!$A14,ABRIL!$L$2:$L$32)","v":0},{"$f":"SUMIF(MAYO!$A$2:$A$32,Valores!$A14,MAYO!$H$2:$H$32)+SUMIF(MAYO!$A$2:$A$32,Valores!$A14,MAYO!$L$2:$L$32)","v":0},{"$f":"SUMIF(JUNIO!$A$2:$A$32,Valores!$A14,JUNIO!$H$2:$H$31)+SUMIF(JUNIO!$A$2:$A$32,Valores!$A14,JUNIO!$L$2:$L$32)","v":0},{"$f":"SUMIF(JULIO!$A$2:$A$32,Valores!$A14,JULIO!$H$2:$H$32)+SUMIF(JULIO!$A$2:$A$32,Valores!$A14,JULIO!$L$2:$L$32)","v":0},{"$f":"SUMIF(AGOSTO!$A$2:$A$32,Valores!$A14,AGOSTO!$H$2:$H$32)+SUMIF(AGOSTO!$A$2:$A$32,Valores!$A14,AGOSTO!$L$2:$L$32)","v":0},{"$f":"SUMIF(SEPTIEMBRE!$A$2:$A$32,Valores!$A14,SEPTIEMBRE!$H$2:$H$31)+SUMIF(SEPTIEMBRE!$A$2:$A$32,Valores!$A14,SEPTIEMBRE!$L$2:$L$32)","v":0},{"$f":"SUMIF(OCTUBRE!$A$2:$A$32,Valores!$A14,OCTUBRE!$H$2:$H$32)+SUMIF(OCTUBRE!$A$2:$A$32,Valores!$A14,OCTUBRE!$L$2:$L$32)","v":0},{"$f":"SUMIF(NOVIEMBRE!$A$2:$A$32,Valores!$A14,NOVIEMBRE!$H$2:$H$31)+SUMIF(NOVIEMBRE!$A$2:$A$32,Valores!$A14,NOVIEMBRE!$L$2:$L$32)","v":0},{"$f":"SUMIF(DICIEMBRE!$A$2:$A$32,Valores!$A14,DICIEMBRE!$H$2:$H$32)+SUMIF(DICIEMBRE!$A$2:$A$32,Valores!$A14,DICIEMBRE!$L$2:$L$32)","v":0},0]
[6,{"$f":"SUMIF(ENERO!$A$2:$A$32,Valores!$A15,ENERO!$H$2:$H$32)+SUMIF(ENERO!$A$2:$A$32,Valores!$A15,ENERO!$L$2:$L$32)","v":0},{"$f":"SUMIF(FEBRERO!$A$2:$A$32,Valores!$A15,FEBRERO!$H$2:$H$29)+SUMIF(FEBRERO!$A$2:$A$32,Valores!$A15,FEBRERO!$L$2:$L$32)","v":0},{"$f":"SUMIF(MARZO!$A$2:$A$32,Valores!$A15,MARZO!$H$2:$H$32)+SUMIF(MARZO!$A$2:$A$32,Valores!$A15,MARZO!$L$2:$L$32)","v":0},{"$f":"SUMIF(ABRIL!$A$2:$A$32,Valores!$A15,ABRIL!$H$2:$H$31)+SUMIF(ABRIL!$A$2:$A$32,Valores!$A15,ABRIL!$L$2:$L$32)","v":0},{"$f":"SUMIF(MAYO!$A$2:$A$32,Valores!$A15,MAYO!$H$2:$H$32)+SUMIF(MAYO!$A$2:$A$32,Valores!$A15,MAYO!$L$2:$L$32)","v":0},{"$f":"SUMIF(JUNIO!$A$2:$A$32,Valores!$A15,JUNIO!$H$2:$H$31)+SUMIF(JUNIO!$A$2:$A$32,Valores!$A15,JUNIO!$L$2:$L$32)","v":0},{"$f":"SUMIF(JULIO!$A$2:$A$32,Valores!$A15,JULIO!$H$2:$H$32)+SUMIF(JULIO!$A$2:$A$32,Valores!$A15,JULIO!$L$2:$L$32)","v":0},{"$f":"SUMIF(AGOSTO!$A$2:$A$32,Valores!$A15,AGOSTO!$H$2:$H$32)+SUMIF(AGOSTO!$A$2:$A$32,Valores!$A15,AGOSTO!$L$2:$L$32)","v":0},{"$f":"SUMIF(SEPTIEMBRE!$A$2:$A$32,Valores!$A15,SEPTIEMBRE!$H$2:$H$31)+SUMIF(SEPTIEMBRE!$A$2:$A$32,Valores!$A15,SEPTIEMBRE!$L$2:$L$32)","v":0},{"$f":"SUMIF(OCTUBRE!$A$2:$A$32,Valores!$A15,OCTUBRE!$H$2:$H$32)+SUMIF(OCTUBRE!$A$2:$A$32,Valores!$A15,OCTUBRE!$L$2:$L$32)","v":0},{"$f":"SUMIF(NOVIEMBRE!$A$2:$A$32,Valores!$A15,NOVIEMBRE!$H$2:$H$31)+SUMIF(NOVIEMBRE!$A$2:$A$32,Valores!$A15,NOVIEMBRE!$L$2:$L$32)","v":0},{"$f":"SUMIF(DICIEMBRE!$A$2:$A$32,Valores!$A15,DICIEMBRE!$H$2:$H$32)+SUMIF(DICIEMBRE!$A$2:$A$32,Valores!$A15,DICIEMBRE!$L$2:$L$32)","v":0},0]
[7,{"$f":"SUMIF(ENERO!$A$2:$A$32,Valores!$A16,ENERO!$H$2:$H$32)+SUMIF(ENERO!$A$2:$A$32,Valores!$A16,ENERO!$L$2:$L$32)","v":0},{"$f":"SUMIF(FEBRERO!$A$2:$A$32,Valores!$A16,FEBRERO!$H$2:$H$29)+SUMIF(FEBRERO!$A$2:$A$32,Valores!$A16,FEBRERO!$L$2:$L$32)","v":0},{"$f":"SUMIF(MARZO!$A$2:$A$32,Valores!$A16,MARZO!$H$2:$H$32)+SUMIF(MARZO!$A$2:$A$32,Valores!$A16,MARZO!$L$2:$L$32)","v":0},{"$f":"SUMIF(ABRIL!$A$2:$A$32,Valores!$A16,ABRIL!$H$2:$H$31)+SUMIF(ABRIL!$A$2:$A$32,Valores!$A16,ABRIL!$L$2:$L$32)","v":0},{"$f":"SUMIF(MAYO!$A$2:$A$32,Valores!$A16,MAYO!$H$2:$H$32)+SUMIF(MAYO!$A$2:$A$32,Valores!$A16,MAYO!$L$2:$L$32)","v":0},{"$f":"SUMIF(JUNIO!$A$2:$A$32,Valores!$A16,JUNIO!$H$2:$H$31)+SUMIF(JUNIO!$A$2:$A$32,Valores!$A16,JUNIO!$L$2:$L$32)","v":0},{"$f":"SUMIF(JULIO!$A$2:$A$32,Valores!$A16,JULIO!$H$2:$H$32)+SUMIF(JULIO!$A$2:$A$32,Valores!$A16,JULIO!$L$2:$L$32)","v":0},{"$f":"SUMIF(AGOSTO!$A$2:$A$32,Valores!$A16,AGOSTO!$H$2:$H$32)+SUMIF(AGOSTO!$A$2:$A$32,Valores!$A16,AGOSTO!$L$2:$L$32)","v":0},{"$f":"SUMIF(SEPTIEMBRE!$A$2:$A$32,Valores!$A16,SEPTIEMBRE!$H$2:$H$31)+SUMIF(SEPTIEMBRE!$A$2:$A$32,Valores!$A16,SEPTIEMBRE!$L$2:$L$32)","v":0},{"$f":"SUMIF(OCTUBRE!$A$2:$A$32,Valores!$A16,OCTUBRE!$H$2:$H$32)+SUMIF(OCTUBRE!$A$2:$A$32,Valores!$A16,OCTUBRE!$L$2:$L$32)","v":0},{"$f":"SUMIF(NOVIEMBRE!$A$2:$A$32,Valores!$A16,NOVIEMBRE!$H$2:$H$31)+SUMIF(NOVIEMBRE!$A$2:$A$32,Valores!$A16,NOVIEMBRE!$L$2:$L$32)","v":0},{"$f":"SUMIF(DICIEMBRE!$A$2:$A$32,Valores!$A16,DICIEMBRE!$H$2:$H$32)+SUMIF(DICIEMBRE!$A$2:$A$32,Valores!$A16,DICIEMBRE!$L$2:$L$32)","v":0},0]
[8,{"$f":"SUMIF(ENERO!$A$2:$A$32,Valores!$A17,ENERO!$H$2:$H$32)+SUMIF(ENERO!$A$2:$A$32,Valores!$A17,ENERO!$L$2:$L$32)","v":0},{"$f":"SUMIF(FEBRERO!$A$2:$A$32,Valores!$A17,FEBRERO!$H$2:$H$29)+SUMIF(FEBRERO!$A$2:$A$32,Valores!$A17,FEBRERO!$L$2:$L$32)","v":0},{"$f":"SUMIF(MARZO!$A$2:$A$32,Valores!$A17,MARZO!$H$2:$H$32)+SUMIF(MARZO!$A$2:$A$32,Valores!$A17,MARZO!$L$2:$L$32)","v":0},{"$f":"SUMIF(ABRIL!$A$2:$A$32,Valores!$A17,ABRIL!$H$2:$H$31)+SUMIF(ABRIL!$A$2:$A$32,Valores!$A17,ABRIL!$L$2:$L$32)","v":0},{"$f":"SUMIF(MAYO!$A$2:$A$32,Valores!$A17,MAYO!$H$2:$H$32)+SUMIF(MAYO!$A$2:$A$32,Valores!$A17,MAYO!$L$2:$L$32)","v":0},{"$f":"SUMIF(JUNIO!$A$2:$A$32,Valores!$A17,JUNIO!$H$2:$H$31)+SUMIF(JUNIO!$A$2:$A$32,Valores!$A17,JUNIO!$L$2:$L$32)","v":0},{"$f":"SUMIF(JULIO!$A$2:$A$32,Valores!$A17,JULIO!$H$2:$H$32)+SUMIF(JULIO!$A$2:$A$32,Valores!$A17,JULIO!$L$2:$L$32)","v":0},{"$f":"SUMIF(AGOSTO!$A$2:$A$32,Valores!$A17,AGOSTO!$H$2:$H$32)+SUMIF(AGOSTO!$A$2:$A$32,Valores!$A17,AGOSTO!$L$2:$L$32)","v":0},{"$f":"SUMIF(SEPTIEMBRE!$A$2:$A$32,Valores!$A17,SEPTIEMBRE!$H$2:$H$31)+SUMIF(SEPTIEMBRE!$A$2:$A$32,Valores!$A17,SEPTIEMBRE!$L$2:$L$32)","v":0},{"$f":"SUMIF(OCTUBRE!$A$2:$A$32,Valores!$A17,OCTUBRE!$H$2:$H$32)+SUMIF(OCTUBRE!$A$2:$A$32,Valores!$A17,OCTUBRE!$L$2:$L$32)","v":0},{"$f":"SUMIF(NOVIEMBRE!$A$2:$A$32,Valores!$A17,NOVIEMBRE!$H$2:$H$31)+SUMIF(NOVIEMBRE!$A$2:$A$32,Valores!$A17,NOVIEMBRE!$L$2:$L$32)","v":0},{"$f":"SUMIF(DICIEMBRE!$A$2:$A$32,Valores!$A17,DICIEMBRE!$H$2:$H$32)+SUMIF(DICIEMBRE!$A$2:$A$32,Valores!$A17,DICIEMBRE!$L$2:$L$32)","v":0},0]
[9,{"$f":"SUMIF(ENERO!$A$2:$A$32,Valores!$A18,ENERO!$H$2:$H$32)+SUMIF(ENERO!$A$2:$A$32,Valores!$A18,ENERO!$L$2:$L$32)","v":0},{"$f":"SUMIF(FEBRERO!$A$2:$A$32,Valores!$A18,FEBRERO!$H$2:$H$29)+SUMIF(FEBRERO!$A$2:$A$32,Valores!$A18,FEBRERO!$L$2:$L$32)","v":0},{"$f":"SUMIF(MARZO!$A$2:$A$32,Valores!$A18,MARZO!$H$2:$H$32)+SUMIF(MARZO!$A$2:$A$32,Valores!$A18,MARZO!$L$2:$L$32)","v":0},{"$f":"SUMIF(ABRIL!$A$2:$A$32,Valores!$A18,ABRIL!$H$2:$H$31)+SUMIF(ABRIL!$A$2:$A$32,Valores!$A18,ABRIL!$L$2:$L$32)","v":0},{"$f":"SUMIF(MAYO!$A$2:$A$32,Valores!$A18,MAYO!$H$2:$H$32)+SUMIF(MAYO!$A$2:$A$32,Valores!$A18,MAYO!$L$2:$L$32)","v":0},{"$f":"SUMIF(JUNIO!$A$2:$A$32,Valores!$A18,JUNIO!$H$2:$H$31)+SUMIF(JUNIO!$A$2:$A$32,Valores!$A18,JUNIO!$L$2:$L$32)","v":0},{"$f":"SUMIF(JULIO!$A$2:$A$32,Valores!$A18,JULIO!$H$2:$H$32)+SUMIF(JULIO!$A$2:$A$32,Valores!$A18,JULIO!$L$2:$L$32)","v":0},{"$f":"SUMIF(AGOSTO!$A$2:$A$32,Valores!$A18,AGOSTO!$H$2:$H$32)+SUMIF(AGOSTO!$A$2:$A$32,Valores!$A18,AGOSTO!$L$2:$L$32)","v":0},{"$f":"SUMIF(SEPTIEMBRE!$A$2:$A$32,Valores!$A18,SEPTIEMBRE!$H$2:$H$31)+SUMIF(SEPTIEMBRE!$A$2:$A$32,Valores!$A18,SEPTIEMBRE!$L$2:$L$32)","v":0},{"$f":"SUMIF(OCTUBRE!$A$2:$A$32,Valores!$A18,OCTUBRE!$H$2:$H$32)+SUMIF(OCTUBRE!$A$2:$A$32,Valores!$A18,OCTUBRE!$L$2:$L$32)","v":0},{"$f":"SUMIF(NOVIEMBRE!$A$2:$A$32,Valores!$A18,NOVIEMBRE!$H$2:$H$31)+SUMIF(NOVIEMBRE!$A$2:$A$32,Valores!$A18,NOVIEMBRE!$L$2:$L$32)","v":0},{"$f":"SUMIF(DICIEMBRE!$A$2:$A$32,Valores!$A18,DICIEMBRE!$H$2:$H$32)+SUMIF(DICIEMBRE!$A$2:$A$32,Valores!$A18,DICIEMBRE!$L$2:$L$32)","v":0},0]
[10,{"$f":"SUMIF(ENERO!$A$2:$A$32,Valores!$A19,ENERO!$H$2:$H$32)+SUMIF(ENERO!$A$2:$A$32,Valores!$A19,ENERO!$L$2:$L$32)","v":0},{"$f":"SUMIF(FEBRERO!$A$2:$A$32,Valores!$A19,FEBRERO!$H$2:$H$29)+SUMIF(FEBRERO!$A$2:$A$32,Valores!$A19,FEBRERO!$L$2:$L$32)","v":0},{"$f":"SUMIF(MARZO!$A$2:$A$32,Valores!$A19,MARZO!$H$2:$H$32)+SUMIF(MARZO!$A$2:$A$32,Valores!$A19,MARZO!$L$2:$L$32)","v":0},{"$f":"SUMIF(ABRIL!$A$2:$A$32,Valores!$A19,ABRIL!$H$2:$H$31)+SUMIF(ABRIL!$A$2:$A$32,Valores!$A19,ABRIL!$L$2:$L$32)","v":0},{"$f":"SUMIF(MAYO!$A$2:$A$32,Valores!$A19,MAYO!$H$2:$H$32)+SUMIF(MAYO!$A$2:$A$32,Valores!$A19,MAYO!$L$2:$L$32)","v":0},{"$f":"SUMIF(JUNIO!$A$2:$A$32,Valores!$A19,JUNIO!$H$2:$H$31)+SUMIF(JUNIO!$A$2:$A$32,Valores!$A19,JUNIO!$L$2:$L$32)","v":0},{"$f":"SUMIF(JULIO!$A$2:$A$32,Valores!$A19,JULIO!$H$2:$H$32)+SUMIF(JULIO!$A$2:$A$32,Valores!$A19,JULIO!$L$2:$L$32)","v":0},{"$f":"SUMIF(AGOSTO!$A$2:$A$32,Valores!$A19,AGOSTO!$H$2:$H$32)+SUMIF(AGOSTO!$A$2:$A$32,Valores!$A19,AGOSTO!$L$2:$L$32)","v":0},{"$f":"SUMIF(SEPTIEMBRE!$A$2:$A$32,Valores!$A19,SEPTIEMBRE!$H$2:$H$31)+SUMIF(SEPTIEMBRE!$A$2:$A$32,Valores!$A19,SEPTIEMBRE!$L$2:$L$32)","v":0},{"$f":"SUMIF(OCTUBRE!$A$2:$A$32,Valores!$A19,OCTUBRE!$H$2:$H$32)+SUMIF(OCTUBRE!$A$2:$A$32,Valores!$A19,OCTUBRE!$L$2:$L$32)","v":0},{"$f":"SUMIF(NOVIEMBRE!$A$2:$A$32,Valores!$A19,NOVIEMBRE!$H$2:$H$31)+SUMIF(NOVIEMBRE!$A$2:$A$32,Valores!$A19,NOVIEMBRE!$L$2:$L$32)","v":0},{"$f":"SUMIF(DICIEMBRE!$A$2:$A$32,Valores!$A19,DICIEMBRE!$H$2:$H$32)+SUMIF(DICIEMBRE!$A$2:$A$32,Valores!$A19,DICIEMBRE!$L$2:$L$32)","v":0},0]
[11,{"$f":"SUMIF(ENERO!$A$2:$A$32,Valores!$A20,ENERO!$H$2:$H$32)+SUMIF(ENERO!$A$2:$A$32,Valores!$A20,ENERO!$L$2:$L$32)","v":0},{"$f":"SUMIF(FEBRERO!$A$2:$A$32,Valores!$A20,FEBRERO!$H$2:$H$29)+SUMIF(FEBRERO!$A$2:$A$32,Valores!$A20,FEBRERO!$L$2:$L$32)","v":0},{"$f":"SUMIF(MARZO!$A$2:$A$32,Valores!$A20,MARZO!$H$2:$H$32)+SUMIF(MARZO!$A$2:$A$32,Valores!$A20,MARZO!$L$2:$L$32)","v":0},{"$f":"SUMIF(ABRIL!$A$2:$A$32,Valores!$A20,ABRIL!$H$2:$H$31)+SUMIF(ABRIL!$A$2:$A$32,Valores!$A20,ABRIL!$L$2:$L$32)","v":0},{"$f":"SUMIF(MAYO!$A$2:$A$32,Valores!$A20,MAYO!$H$2:$H$32)+SUMIF(MAYO!$A$2:$A$32,Valores!$A20,MAYO!$L$2:$L$32)","v":0},{"$f":"SUMIF(JUNIO!$A$2:$A$32,Valores!$A20,JUNIO!$H$2:$H$31)+SUMIF(JUNIO!$A$2:$A$32,Valores!$A20,JUNIO!$L$2:$L$32)","v":0},{"$f":"SUMIF(JULIO!$A$2:$A$32,Valores!$A20,JULIO!$H$2:$H$32)+SUMIF(JULIO!$A$2:$A$32,Valores!$A20,JULIO!$L$2:$L$32)","v":0},{"$f":"SUMIF(AGOSTO!$A$2:$A$32,Valores!$A20,AGOSTO!$H$2:$H$32)+SUMIF(AGOSTO!$A$2:$A$32,Valores!$A20,AGOSTO!$L$2:$L$32)","v":0},{"$f":"SUMIF(SEPTIEMBRE!$A$2:$A$32,Valores!$A20,SEPTIEMBRE!$H$2:$H$31)+SUMIF(SEPTIEMBRE!$A$2:$A$32,Valores!$A20,SEPTIEMBRE!$L$2:$L$32)","v":0},{"$f":"SUMIF(OCTUBRE!$A$2:$A$32,Valores!$A20,OCTUBRE!$H$2:$H$32)+SUMIF(OCTUBRE!$A$2:$A$32,Valores!$A20,OCTUBRE!$L$2:$L$32)","v":0},{"$f":"SUMIF(NOVIEMBRE!$A$2:$A$32,Valores!$A20,NOVIEMBRE!$H$2:$H$31)+SUMIF(NOVIEMBRE!$A$2:$A$32,Valores!$A20,NOVIEMBRE!$L$2:$L$32)","v":0},{"$f":"SUMIF(DICIEMBRE!$A$2:$A$32,Valores!$A20,DICIEMBRE!$H$2:$H$32)+SUMIF(DICIEMBRE!$A$2:$A$32,Valores!$A20,DICIEMBRE!$L$2:$L$32)","v":0},0]
[12,{"$f":"SUMIF(ENERO!$A$2:$A$32,Valores!$A21,ENERO!$H$2:$H$32)+SUMIF(ENERO!$A$2:$A$32,Valores!$A21,ENERO!$L$2:$L$32)","v":0},{"$f":"SUMIF(FEBRERO!$A$2:$A$32,Valores!$A21,FEBRERO!$H$2:$H$29)+SUMIF(FEBRERO!$A$2:$A$32,Valores!$A21,FEBRERO!$L$2:$L$32)","v":0},{"$f":"SUMIF(MARZO!$A$2:$A$32,Valores!$A21,MARZO!$H$2:$H$32)+SUMIF(MARZO!$A$2:$A$32,Valores!$A21,MARZO!$L$2:$L$32)","v":0},{"$f":"SUMIF(ABRIL!$A$2:$A$32,Valores!$A21,ABRIL!$H$2:$H$31)+SUMIF(ABRIL!$A$2:$A$32,Valores!$A21,ABRIL!$L$2:$L$32)","v":0},{"$f":"SUMIF(MAYO!$A$2:$A$32,Valores!$A21,MAYO!$H$2:$H$32)+SUMIF(MAYO!$A$2:$A$32,Valores!$A21,MAYO!$L$2:$L$32)","v":0},{"$f":"SUMIF(JUNIO!$A$2:$A$32,Valores!$A21,JUNIO!$H$2:$H$31)+SUMIF(JUNIO!$A$2:$A$32,Valores!$A21,JUNIO!$L$2:$L$32)","v":0},{"$f":"SUMIF(JULIO!$A$2:$A$32,Valores!$A21,JULIO!$H$2:$H$32)+SUMIF(JULIO!$A$2:$A$32,Valores!$A21,JULIO!$L$2:$L$32)","v":0},{"$f":"SUMIF(AGOSTO!$A$2:$A$32,Valores!$A21,AGOSTO!$H$2:$H$32)+SUMIF(AGOSTO!$A$2:$A$32,Valores!$A21,AGOSTO!$L$2:$L$32)","v":0},{"$f":"SUMIF(SEPTIEMBRE!$A$2:$A$32,Valores!$A21,SEPTIEMBRE!$H$2:$H$31)+SUMIF(SEPTIEMBRE!$A$2:$A$32,Valores!$A21,SEPTIEMBRE!$L$2:$L$32)","v":0},{"$f":"SUMIF(OCTUBRE!$A$2:$A$32,Valores!$A21,OCTUBRE!$H$2:$H$32)+SUMIF(OCTUBRE!$A$2:$A$32,Valores!$A21,OCTUBRE!$L$2:$L$32)","v":0},{"$f":"SUMIF(NOVIEMBRE!$A$2:$A$32,Valores!$A21,NOVIEMBRE!$H$2:$H$31)+SUMIF(NOVIEMBRE!$A$2:$A$32,Valores!$A21,NOVIEMBRE!$L$2:$L$32)","v":0},{"$f":"SUMIF(DICIEMBRE!$A$2:$A$32,Valores!$A21,DICIEMBRE!$H$2:$H$32)+SUMIF(DICIEMBRE!$A$2:$A$32,Valores!$A21,DICIEMBRE!$L$2:$L$32)","v":0},0]
[13,{"$f":"SUMIF(ENERO!$A$2:$A$32,Valores!$A22,ENERO!$H$2:$H$32)+SUMIF(ENERO!$A$2:$A$32,Valores!$A22,ENERO!$L$2:$L$32)","v":0},{"$f":"SUMIF(FEBRERO!$A$2:$A$32,Valores!$A22,FEBRERO!$H$2:$H$29)+SUMIF(FEBRERO!$A$2:$A$32,Valores!$A22,FEBRERO!$L$2:$L$32)","v":0},{"$f":"SUMIF(MARZO!$A$2:$A$32,Valores!$A22,MARZO!$H$2:$H$32)+SUMIF(MARZO!$A$2:$A$32,Valores!$A22,MARZO!$L$2:$L$32)","v":0},{"$f":"SUMIF(ABRIL!$A$2:$A$32,Valores!$A22,ABRIL!$H$2:$H$31)+SUMIF(ABRIL!$A$2:$A$32,Valores!$A22,ABRIL!$L$2:$L$32)","v":0},{"$f":"SUMIF(MAYO!$A$2:$A$32,Valores!$A22,MAYO!$H$2:$H$32)+SUMIF(MAYO!$A$2:$A$32,Valores!$A22,MAYO!$L$2:$L$32)","v":0},{"$f":"SUMIF(JUNIO!$A$2:$A$32,Valores!$A22,JUNIO!$H$2:$H$31)+SUMIF(JUNIO!$A$2:$A$32,Valores!$A22,JUNIO!$L$2:$L$32)","v":0},{"$f":"SUMIF(JULIO!$A$2:$A$32,Valores!$A22,JULIO!$H$2:$H$32)+SUMIF(JULIO!$A$2:$A$32,Valores!$A22,JULIO!$L$2:$L$32)","v":0},{"$f":"SUMIF(AGOSTO!$A$2:$A$32,Valores!$A22,AGOSTO!$H$2:$H$32)+SUMIF(AGOSTO!$A$2:$A$32,Valores!$A22,AGOSTO!$L$2:$L$32)","v":0},{"$f":"SUMIF(SEPTIEMBRE!$A$2:$A$32,Valores!$A22,SEPTIEMBRE!$H$2:$H$31)+SUMIF(SEPTIEMBRE!$A$2:$A$32,Valores!$A22,SEPTIEMBRE!$L$2:$L$32)","v":0},{"$f":"SUMIF(OCTUBRE!$A$2:$A$32,Valores!$A22,OCTUBRE!$H$2:$H$32)+SUMIF(OCTUBRE!$A$2:$A$32,Valores!$A22,OCTUBRE!$L$2:$L$32)","v":0},{"$f":"SUMIF(NOVIEMBRE!$A$2:$A$32,Valores!$A22,NOVIEMBRE!$H$2:$H$31)+SUMIF(NOVIEMBRE!$A$2:$A$32,Valores!$A22,NOVIEMBRE!$L$2:$L$32)","v":0},{"$f":"SUMIF(DICIEMBRE!$A$2:$A$32,Valores!$A22,DICIEMBRE!$H$2:$H$32)+SUMIF(DICIEMBRE!$A$2:$A$32,Valores!$A22,DICIEMBRE!$L$2:$L$32)","v":0},0]
[14,{"$f":"SUMIF(ENERO!$A$2:$A$32,Valores!$A23,ENERO!$H$2:$H$32)+SUMIF(ENERO!$A$2:$A$32,Valores!$A23,ENERO!$L$2:$L$32)","v":0},{"$f":"SUMIF(FEBRERO!$A$2:$A$32,Valores!$A23,FEBRERO!$H$2:$H$29)+SUMIF(FEBRERO!$A$2:$A$32,Valores!$A23,FEBRERO!$L$2:$L$32)","v":0},{"$f":"SUMIF(MARZO!$A$2:$A$32,Valores!$A23,MARZO!$H$2:$H$32)+SUMIF(MARZO!$A$2:$A$32,Valores!$A23,MARZO!$L$2:$L$32)","v":0},{"$f":"SUMIF(ABRIL!$A$2:$A$32,Valores!$A23,ABRIL!$H$2:$H$31)+SUMIF(ABRIL!$A$2:$A$32,Valores!$A23,ABRIL!$L$2:$L$32)","v":0},{"$f":"SUMIF(MAYO!$A$2:$A$32,Valores!$A23,MAYO!$H$2:$H$32)+SUMIF(MAYO!$A$2:$A$32,Valores!$A23,MAYO!$L$2:$L$32)","v":0},{"$f":"SUMIF(JUNIO!$A$2:$A$32,Valores!$A23,JUNIO!$H$2:$H$31)+SUMIF(JUNIO!$A$2:$A$32,Valores!$A23,JUNIO!$L$2:$L$32)","v":0},{"$f":"SUMIF(JULIO!$A$2:$A$32,Valores!$A23,JULIO!$H$2:$H$32)+SUMIF(JULIO!$A$2:$A$32,Valores!$A23,JULIO!$L$2:$L$32)","v":0},{"$f":"SUMIF(AGOSTO!$A$2:$A$32,Valores!$A23,AGOSTO!$H$2:$H$32)+SUMIF(AGOSTO!$A$2:$A$32,Valores!$A23,AGOSTO!$L$2:$L$32)","v":0},{"$f":"SUMIF(SEPTIEMBRE!$A$2:$A$32,Valores!$A23,SEPTIEMBRE!$H$2:$H$31)+SUMIF(SEPTIEMBRE!$A$2:$A$32,Valores!$A23,SEPTIEMBRE!$L$2:$L$32)","v":0},{"$f":"SUMIF(OCTUBRE!$A$2:$A$32,Valores!$A23,OCTUBRE!$H$2:$H$32)+SUMIF(OCTUBRE!$A$2:$A$32,Valores!$A23,OCTUBRE!$L$2:$L$32)","v":0},{"$f":"SUMIF(NOVIEMBRE!$A$2:$A$32,Valores!$A23,NOVIEMBRE!$H$2:$H$31)+SUMIF(NOVIEMBRE!$A$2:$A$32,Valores!$A23,NOVIEMBRE!$L$2:$L$32)","v":0},{"$f":"SUMIF(DICIEMBRE!$A$2:$A$32,Valores!$A23,DICIEMBRE!$H$2:$H$32)+SUMIF(DICIEMBRE!$A$2:$A$32,Valores!$A23,DICIEMBRE!$L$2:$L$32)","v":0},0]
[15,{"$f":"SUMIF(ENERO!$A$2:$A$32,Valores!$A24,ENERO!$H$2:$H$32)+SUMIF(ENERO!$A$2:$A$32,Valores!$A24,ENERO!$L$2:$L$32)","v":0},{"$f":"SUMIF(FEBRERO!$A$2:$A$32,Valores!$A24,FEBRERO!$H$2:$H$29)+SUMIF(FEBRERO!$A$2:$A$32,Valores!$A24,FEBRERO!$L$2:$L$32)","v":0},{"$f":"SUMIF(MARZO!$A$2:$A$32,Valores!$A24,MARZO!$H$2:$H$32)+SUMIF(MARZO!$A$2:$A$32,Valores!$A24,MARZO!$L$2:$L$32)","v":0},{"$f":"SUMIF(ABRIL!$A$2:$A$32,Valores!$A24,ABRIL!$H$2:$H$31)+SUMIF(ABRIL!$A$2:$A$32,Valores!$A24,ABRIL!$L$2:$L$32)","v":0},{"$f":"SUMIF(MAYO!$A$2:$A$32,Valores!$A24,MAYO!$H$2:$H$32)+SUMIF(MAYO!$A$2:$A$32,Valores!$A24,MAYO!$L$2:$L$32)","v":0},{"$f":"SUMIF(JUNIO!$A$2:$A$32,Valores!$A24,JUNIO!$H$2:$H$31)+SUMIF(JUNIO!$A$2:$A$32,Valores!$A24,JUNIO!$L$2:$L$32)","v":0},{"$f":"SUMIF(JULIO!$A$2:$A$32,Valores!$A24,JULIO!$H$2:$H$32)+SUMIF(JULIO!$A$2:$A$32,Valores!$A24,JULIO!$L$2:$L$32)","v":0},{"$f":"SUMIF(AGOSTO!$A$2:$A$32,Valores!$A24,AGOSTO!$H$2:$H$32)+SUMIF(AGOSTO!$A$2:$A$32,Valores!$A24,AGOSTO!$L$2:$L$32)","v":0},{"$f":"SUMIF(SEPTIEMBRE!$A$2:$A$32,Valores!$A24,SEPTIEMBRE!$H$2:$H$31)+SUMIF(SEPTIEMBRE!$A$2:$A$32,Valores!$A24,SEPTIEMBRE!$L$2:$L$32)","v":0},{"$f":"SUMIF(OCTUBRE!$A$2:$A$32,Valores!$A24,OCTUBRE!$H$2:$H$32)+SUMIF(OCTUBRE!$A$2:$A$32,Valores!$A24,OCTUBRE!$L$2:$L$32)","v":0},{"$f":"SUMIF(NOVIEMBRE!$A$2:$A$32,Valores!$A24,NOVIEMBRE!$H$2:$H$31)+SUMIF(NOVIEMBRE!$A$2:$A$32,Valores!$A24,NOVIEMBRE!$L$2:$L$32)","v":0},{"$f":"SUMIF(DICIEMBRE!$A$2:$A$32,Valores!$A24,DICIEMBRE!$H$2:$H$32)+SUMIF(DICIEMBRE!$A$2:$A$32,Valores!$A24,DICIEMBRE!$L$2:$L$32)","v":0},0]
[16,{"$f":"SUMIF(ENERO!$A$2:$A$32,Valores!$A25,ENERO!$H$2:$H$32)+SUMIF(ENERO!$A$2:$A$32,Valores!$A25,ENERO!$L$2:$L$32)","v":0},{"$f":"SUMIF(FEBRERO!$A$2:$A$32,Valores!$A25,FEBRERO!$H$2:$H$29)+SUMIF(FEBRERO!$A$2:$A$32,Valores!$A25,FEBRERO!$L$2:$L$32)","v":0},{"$f":"SUMIF(MARZO!$A$2:$A$32,Valores!$A25,MARZO!$H$2:$H$32)+SUMIF(MARZO!$A$2:$A$32,Valores!$A25,MARZO!$L$2:$L$32)","v":0},{"$f":"SUMIF(ABRIL!$A$2:$A$32,Valores!$A25,ABRIL!$H$2:$H$31)+SUMIF(ABRIL!$A$2:$A$32,Valores!$A25,ABRIL!$L$2:$L$32)","v":0},{"$f":"SUMIF(MAYO!$A$2:$A$32,Valores!$A25,MAYO!$H$2:$H$32)+SUMIF(MAYO!$A$2:$A$32,Valores!$A25,MAYO!$L$2:$L$32)","v":0},{"$f":"SUMIF(JUNIO!$A$2:$A$32,Valores!$A25,JUNIO!$H$2:$H$31)+SUMIF(JUNIO!$A$2:$A$32,Valores!$A25,JUNIO!$L$2:$L$32)","v":0},{"$f":"SUMIF(JULIO!$A$2:$A$32,Valores!$A25,JULIO!$H$2:$H$32)+SUMIF(JULIO!$A$2:$A$32,Valores!$A25,JULIO!$L$2:$L$32)","v":0},{"$f":"SUMIF(AGOSTO!$A$2:$A$32,Valores!$A25,AGOSTO!$H$2:$H$32)+SUMIF(AGOSTO!$A$2:$A$32,Valores!$A25,AGOSTO!$L$2:$L$32)","v":0},{"$f":"SUMIF(SEPTIEMBRE!$A$2:$A$32,Valores!$A25,SEPTIEMBRE!$H$2:$H$31)+SUMIF(SEPTIEMBRE!$A$2:$A$32,Valores!$A25,SEPTIEMBRE!$L$2:$L$32)","v":0},{"$f":"SUMIF(OCTUBRE!$A$2:$A$32,Valores!$A25,OCTUBRE!$H$2:$H$32)+SUMIF(OCTUBRE!$A$2:$A$32,Valores!$A25,OCTUBRE!$L$2:$L$32)","v":0},{"$f":"SUMIF(NOVIEMBRE!$A$2:$A$32,Valores!$A25,NOVIEMBRE!$H$2:$H$31)+SUMIF(NOVIEMBRE!$A$2:$A$32,Valores!$A25,NOVIEMBRE!$L$2:$L$32)","v":0},{"$f":"SUMIF(DICIEMBRE!$A$2:$A$32,Valores!$A25,DICIEMBRE!$H$2:$H$32)+SUMIF(DICIEMBRE!$A$2:$A$32,Valores!$A25,DICIEMBRE!$L$2:$L$32)","v":0},0]
[17,{"$f":"SUMIF(ENERO!$A$2:$A$32,Valores!$A26,ENERO!$H$2:$H$32)+SUMIF(ENERO!$A$2:$A$32,Valores!$A26,ENERO!$L$2:$L$32)","v":0},{"$f":"SUMIF(FEBRERO!$A$2:$A$32,Valores!$A26,FEBRERO!$H$2:$H$29)+SUMIF(FEBRERO!$A$2:$A$32,Valores!$A26,FEBRERO!$L$2:$L$32)","v":0},{"$f":"SUMIF(MARZO!$A$2:$A$32,Valores!$A26,MARZO!$H$2:$H$32)+SUMIF(MARZO!$A$2:$A$32,Valores!$A26,MARZO!$L$2:$L$32)","v":0},{"$f":"SUMIF(ABRIL!$A$2:$A$32,Valores!$A26,ABRIL!$H$2:$H$31)+SUMIF(ABRIL!$A$2:$A$32,Valores!$A26,ABRIL!$L$2:$L$32)","v":0},{"$f":"SUMIF(MAYO!$A$2:$A$32,Valores!$A26,MAYO!$H$2:$H$32)+SUMIF(MAYO!$A$2:$A$32,Valores!$A26,MAYO!$L$2:$L$32)","v":0},{"$f":"SUMIF(JUNIO!$A$2:$A$32,Valores!$A26,JUNIO!$H$2:$H$31)+SUMIF(JUNIO!$A$2:$A$32,Valores!$A26,JUNIO!$L$2:$L$32)","v":0},{"$f":"SUMIF(JULIO!$A$2:$A$32,Valores!$A26,JULIO!$H$2:$H$32)+SUMIF(JULIO!$A$2:$A$32,Valores!$A26,JULIO!$L$2:$L$32)","v":0},{"$f":"SUMIF(AGOSTO!$A$2:$A$32,Valores!$A26,AGOSTO!$H$2:$H$32)+SUMIF(AGOSTO!$A$2:$A$32,Valores!$A26,AGOSTO!$L$2:$L$32)","v":0},{"$f":"SUMIF(SEPTIEMBRE!$A$2:$A$32,Valores!$A26,SEPTIEMBRE!$H$2:$H$31)+SUMIF(SEPTIEMBRE!$A$2:$A$32,Valores!$A26,SEPTIEMBRE!$L$2:$L$32)","v":0},{"$f":"SUMIF(OCTUBRE!$A$2:$A$32,Valores!$A26,OCTUBRE!$H$2:$H$32)+SUMIF(OCTUBRE!$A$2:$A$32,Valores!$A26,OCTUBRE!$L$2:$L$32)","v":0},{"$f":"SUMIF(NOVIEMBRE!$A$2:$A$32,Valores!$A26,NOVIEMBRE!$H$2:$H$31)+SUMIF(NOVIEMBRE!$A$2:$A$32,Valores!$A26,NOVIEMBRE!$L$2:$L$32)","v":0},{"$f":"SUMIF(DICIEMBRE!$A$2:$A$32,Valores!$A26,DICIEMBRE!$H$2:$H$32)+SUMIF(DICIEMBRE!$A$2:$A$32,Valores!$A26,DICIEMBRE!$L$2:$L$32)","v":0},0]
[18,{"$f":"SUMIF(ENERO!$A$2:$A$32,Valores!$A27,ENERO!$H$2:$H$32)+SUMIF(ENERO!$A$2:$A$32,Valores!$A27,ENERO!$L$2:$L$32)","v":0},{"$f":"SUMIF(FEBRERO!$A$2:$A$32,Valores!$A27,FEBRERO!$H$2:$H$29)+SUMIF(FEBRERO!$A$2:$A$32,Valores!$A27,FEBRERO!$L$2:$L$32)","v":0},{"$f":"SUMIF(MARZO!$A$2:$A$32,Valores!$A27,MARZO!$H$2:$H$32)+SUMIF(MARZO!$A$2:$A$32,Valores!$A27,MARZO!$L$2:$L$32)","v":0},{"$f":"SUMIF(ABRIL!$A$2:$A$32,Valores!$A27,ABRIL!$H$2:$H$31)+SUMIF(ABRIL!$A$2:$A$32,Valores!$A27,ABRIL!$L$2:$L$32)","v":0},{"$f":"SUMIF(MAYO!$A$2:$A$32,Valores!$A27,MAYO!$H$2:$H$32)+SUMIF(MAYO!$A$2:$A$32,Valores!$A27,MAYO!$L$2:$L$32)","v":0},{"$f":"SUMIF(JUNIO!$A$2:$A$32,Valores!$A27,JUNIO!$H$2:$H$31)+SUMIF(JUNIO!$A$2:$A$32,Valores!$A27,JUNIO!$L$2:$L$32)","v":0},{"$f":"SUMIF(JULIO!$A$2:$A$32,Valores!$A27,JULIO!$H$2:$H$32)+SUMIF(JULIO!$A$2:$A$32,Valores!$A27,JULIO!$L$2:$L$32)","v":0},{"$f":"SUMIF(AGOSTO!$A$2:$A$32,Valores!$A27,AGOSTO!$H$2:$H$32)+SUMIF(AGOSTO!$A$2:$A$32,Valores!$A27,AGOSTO!$L$2:$L$32)","v":0},{"$f":"SUMIF(SEPTIEMBRE!$A$2:$A$32,Valores!$A27,SEPTIEMBRE!$H$2:$H$31)+SUMIF(SEPTIEMBRE!$A$2:$A$32,Valores!$A27,SEPTIEMBRE!$L$2:$L$32)","v":0},{"$f":"SUMIF(OCTUBRE!$A$2:$A$32,Valores!$A27,OCTUBRE!$H$2:$H$32)+SUMIF(OCTUBRE!$A$2:$A$32,Valores!$A27,OCTUBRE!$L$2:$L$32)","v":0},{"$f":"SUMIF(NOVIEMBRE!$A$2:$A$32,Valores!$A27,NOVIEMBRE!$H$2:$H$31)+SUMIF(NOVIEMBRE!$A$2:$A$32,Valores!$A27,NOVIEMBRE!$L$2:$L$32)","v":0},{"$f":"SUMIF(DICIEMBRE!$A$2:$A$32,Valores!$A27,DICIEMBRE!$H$2:$H$32)+SUMIF(DICIEMBRE!$A$2:$A$32,Valores!$A27,DICIEMBRE!$L$2:$L$32)","v":0},0]
[19,{"$f":"SUMIF(ENERO!$A$2:$A$32,Valores!$A28,ENERO!$H$2:$H$32)+SUMIF(ENERO!$A$2:$A$32,Valores!$A28,ENERO!$L$2:$L$32)","v":0},{"$f":"SUMIF(FEBRERO!$A$2:$A$32,Valores!$A28,FEBRERO!$H$2:$H$29)+SUMIF(FEBRERO!$A$2:$A$32,Valores!$A28,FEBRERO!$L$2:$L$32)","v":0},{"$f":"SUMIF(MARZO!$A$2:$A$32,Valores!$A28,MARZO!$H$2:$H$32)+SUMIF(MARZO!$A$2:$A$32,Valores!$A28,MARZO!$L$2:$L$32)","v":0},{"$f":"SUMIF(ABRIL!$A$2:$A$32,Valores!$A28,ABRIL!$H$2:$H$31)+SUMIF(ABRIL!$A$2:$A$32,Valores!$A28,ABRIL!$L$2:$L$32)","v":0},{"$f":"SUMIF(MAYO!$A$2:$A$32,Valores!$A28,MAYO!$H$2:$H$32)+SUMIF(MAYO!$A$2:$A$32,Valores!$A28,MAYO!$L$2:$L$32)","v":0},{"$f":"SUMIF(JUNIO!$A$2:$A$32,Valores!$A28,JUNIO!$H$2:$H$31)+SUMIF(JUNIO!$A$2:$A$32,Valores!$A28,JUNIO!$L$2:$L$32)","v":0},{"$f":"SUMIF(JULIO!$A$2:$A$32,Valores!$A28,JULIO!$H$2:$H$32)+SUMIF(JULIO!$A$2:$A$32,Valores!$A28,JULIO!$L$2:$L$32)","v":0},{"$f":"SUMIF(AGOSTO!$A$2:$A$32,Valores!$A28,AGOSTO!$H$2:$H$32)+SUMIF(AGOSTO!$A$2:$A$32,Valores!$A28,AGOSTO!$L$2:$L$32)","v":0},{"$f":"SUMIF(SEPTIEMBRE!$A$2:$A$32,Valores!$A28,SEPTIEMBRE!$H$2:$H$31)+SUMIF(SEPTIEMBRE!$A$2:$A$32,Valores!$A28,SEPTIEMBRE!$L$2:$L$32)","v":0},{"$f":"SUMIF(OCTUBRE!$A$2:$A$32,Valores!$A28,OCTUBRE!$H$2:$H$32)+SUMIF(OCTUBRE!$A$2:$A$32,Valores!$A28,OCTUBRE!$L$2:$L$32)","v":0},{"$f":"SUMIF(NOVIEMBRE!$A$2:$A$32,Valores!$A28,NOVIEMBRE!$H$2:$H$31)+SUMIF(NOVIEMBRE!$A$2:$A$32,Valores!$A28,NOVIEMBRE!$L$2:$L$32)","v":0},{"$f":"SUMIF(DICIEMBRE!$A$2:$A$32,Valores!$A28,DICIEMBRE!$H$2:$H$32)+SUMIF(DICIEMBRE!$A$2:$A$32,Valores!$A28,DICIEMBRE!$L$2:$L$32)","v":0},0]
[20,{"$f":"SUMIF(ENERO!$A$2:$A$32,Valores!$A29,ENERO!$H$2:$H$32)+SUMIF(ENERO!$A$2:$A$32,Valores!$A29,ENERO!$L$2:$L$32)","v":0},{"$f":"SUMIF(FEBRERO!$A$2:$A$32,Valores!$A29,FEBRERO!$H$2:$H$29)+SUMIF(FEBRERO!$A$2:$A$32,Valores!$A29,FEBRERO!$L$2:$L$32)","v":0},{"$f":"SUMIF(MARZO!$A$2:$A$32,Valores!$A29,MARZO!$H$2:$H$32)+SUMIF(MARZO!$A$2:$A$32,Valores!$A29,MARZO!$L$2:$L$32)","v":0},{"$f":"SUMIF(ABRIL!$A$2:$A$32,Valores!$A29,ABRIL!$H$2:$H$31)+SUMIF(ABRIL!$A$2:$A$32,Valores!$A29,ABRIL!$L$2:$L$32)","v":0},{"$f":"SUMIF(MAYO!$A$2:$A$32,Valores!$A29,MAYO!$H$2:$H$32)+SUMIF(MAYO!$A$2:$A$32,Valores!$A29,MAYO!$L$2:$L$32)","v":0},{"$f":"SUMIF(JUNIO!$A$2:$A$32,Valores!$A29,JUNIO!$H$2:$H$31)+SUMIF(JUNIO!$A$2:$A$32,Valores!$A29,JUNIO!$L$2:$L$32)","v":0},{"$f":"SUMIF(JULIO!$A$2:$A$32,Valores!$A29,JULIO!$H$2:$H$32)+SUMIF(JULIO!$A$2:$A$32,Valores!$A29,JULIO!$L$2:$L$32)","v":0},{"$f":"SUMIF(AGOSTO!$A$2:$A$32,Valores!$A29,AGOSTO!$H$2:$H$32)+SUMIF(AGOSTO!$A$2:$A$32,Valores!$A29,AGOSTO!$L$2:$L$32)","v":0},{"$f":"SUMIF(SEPTIEMBRE!$A$2:$A$32,Valores!$A29,SEPTIEMBRE!$H$2:$H$31)+SUMIF(SEPTIEMBRE!$A$2:$A$32,Valores!$A29,SEPTIEMBRE!$L$2:$L$32)","v":0},{"$f":"SUMIF(OCTUBRE!$A$2:$A$32,Valores!$A29,OCTUBRE!$H$2:$H$32)+SUMIF(OCTUBRE!$A$2:$A$32,Valores!$A29,OCTUBRE!$L$2:$L$32)","v":0},{"$f":"SUMIF(NOVIEMBRE!$A$2:$A$32,Valores!$A29,NOVIEMBRE!$H$2:$H$31)+SUMIF(NOVIEMBRE!$A$2:$A$32,Valores!$A29,NOVIEMBRE!$L$2:$L$32)","v":0},{"$f":"SUMIF(DICIEMBRE!$A$2:$A$32,Valores!$A29,DICIEMBRE!$H$2:$H$32)+SUMIF(DICIEMBRE!$A$2:$A$32,Valores!$A29,DICIEMBRE!$L$2:$L$32)","v":0},0]
[21,{"$f":"SUMIF(ENERO!$A$2:$A$32,Valores!$A30,ENERO!$H$2:$H$32)+SUMIF(ENERO!$A$2:$A$32,Valores!$A30,ENERO!$L$2:$L$32)","v":0},{"$f":"SUMIF(FEBRERO!$A$2:$A$32,Valores!$A30,FEBRERO!$H$2:$H$29)+SUMIF(FEBRERO!$A$2:$A$32,Valores!$A30,FEBRERO!$L$2:$L$32)","v":0},{"$f":"SUMIF(MARZO!$A$2:$A$32,Valores!$A30,MARZO!$H$2:$H$32)+SUMIF(MARZO!$A$2:$A$32,Valores!$A30,MARZO!$L$2:$L$32)","v":0},{"$f":"SUMIF(ABRIL!$A$2:$A$32,Valores!$A30,ABRIL!$H$2:$H$31)+SUMIF(ABRIL!$A$2:$A$32,Valores!$A30,ABRIL!$L$2:$L$32)","v":0},{"$f":"SUMIF(MAYO!$A$2:$A$32,Valores!$A30,MAYO!$H$2:$H$32)+SUMIF(MAYO!$A$2:$A$32,Valores!$A30,MAYO!$L$2:$L$32)","v":0},{"$f":"SUMIF(JUNIO!$A$2:$A$32,Valores!$A30,JUNIO!$H$2:$H$31)+SUMIF(JUNIO!$A$2:$A$32,Valores!$A30,JUNIO!$L$2:$L$32)","v":0},{"$f":"SUMIF(JULIO!$A$2:$A$32,Valores!$A30,JULIO!$H$2:$H$32)+SUMIF(JULIO!$A$2:$A$32,Valores!$A30,JULIO!$L$2:$L$32)","v":0},{"$f":"SUMIF(AGOSTO!$A$2:$A$32,Valores!$A30,AGOSTO!$H$2:$H$32)+SUMIF(AGOSTO!$A$2:$A$32,Valores!$A30,AGOSTO!$L$2:$L$32)","v":0},{"$f":"SUMIF(SEPTIEMBRE!$A$2:$A$32,Valores!$A30,SEPTIEMBRE!$H$2:$H$31)+SUMIF(SEPTIEMBRE!$A$2:$A$32,Valores!$A30,SEPTIEMBRE!$L$2:$L$32)","v":0},{"$f":"SUMIF(OCTUBRE!$A$2:$A$32,Valores!$A30,OCTUBRE!$H$2:$H$32)+SUMIF(OCTUBRE!$A$2:$A$32,Valores!$A30,OCTUBRE!$L$2:$L$32)","v":0},{"$f":"SUMIF(NOVIEMBRE!$A$2:$A$32,Valores!$A30,NOVIEMBRE!$H$2:$H$31)+SUMIF(NOVIEMBRE!$A$2:$A$32,Valores!$A30,NOVIEMBRE!$L$2:$L$32)","v":0},{"$f":"SUMIF(DICIEMBRE!$A$2:$A$32,Valores!$A30,DICIEMBRE!$H$2:$H$32)+SUMIF(DICIEMBRE!$A$2:$A$32,Valores!$A30,DICIEMBRE!$L$2:$L$32)","v":0},0]
[22,{"$f":"SUMIF(ENERO!$A$2:$A$32,Valores!$A31,ENERO!$H$2:$H$32)+SUMIF(ENERO!$A$2:$A$32,Valores!$A31,ENERO!$L$2:$L$32)","v":0},{"$f":"SUMIF(FEBRERO!$A$2:$A$32,Valores!$A31,FEBRERO!$H$2:$H$29)+SUMIF(FEBRERO!$A$2:$A$32,Valores!$A31,FEBRERO!$L$2:$L$32)","v":0},{"$f":"SUMIF(MARZO!$A$2:$A$32,Valores!$A31,MARZO!$H$2:$H$32)+SUMIF(MARZO!$A$2:$A$32,Valores!$A31,MARZO!$L$2:$L$32)","v":0},{"$f":"SUMIF(ABRIL!$A$2:$A$32,Valores!$A31,ABRIL!$H$2:$H$31)+SUMIF(ABRIL!$A$2:$A$32,Valores!$A31,ABRIL!$L$2:$L$32)","v":0},{"$f":"SUMIF(MAYO!$A$2:$A$32,Valores!$A31,MAYO!$H$2:$H$32)+SUMIF(MAYO!$A$2:$A$32,Valores!$A31,MAYO!$L$2:$L$32)","v":0},{"$f":"SUMIF(JUNIO!$A$2:$A$32,Valores!$A31,JUNIO!$H$2:$H$31)+SUMIF(JUNIO!$A$2:$A$32,Valores!$A31,JUNIO!$L$2:$L$32)","v":0},{"$f":"SUMIF(JULIO!$A$2:$A$32,Valores!$A31,JULIO!$H$2:$H$32)+SUMIF(JULIO!$A$2:$A$32,Valores!$A31,JULIO!$L$2:$L$32)","v":0},{"$f":"SUMIF(AGOSTO!$A$2:$A$32,Valores!$A31,AGOSTO!$H$2:$H$32)+SUMIF(AGOSTO!$A$2:$A$32,Valores!$A31,AGOSTO!$L$2:$L$32)","v":0},{"$f":"SUMIF(SEPTIEMBRE!$A$2:$A$32,Valores!$A31,SEPTIEMBRE!$H$2:$H$31)+SUMIF(SEPTIEMBRE!$A$2:$A$32,Valores!$A31,SEPTIEMBRE!$L$2:$L$32)","v":0},{"$f":"SUMIF(OCTUBRE!$A$2:$A$32,Valores!$A31,OCTUBRE!$H$2:$H$32)+SUMIF(OCTUBRE!$A$2:$A$32,Valores!$A31,OCTUBRE!$L$2:$L$32)","v":0},{"$f":"SUMIF(NOVIEMBRE!$A$2:$A$32,Valores!$A31,NOVIEMBRE!$H$2:$H$31)+SUMIF(NOVIEMBRE!$A$2:$A$32,Valores!$A31,NOVIEMBRE!$L$2:$L$32)","v":0},{"$f":"SUMIF(DICIEMBRE!$A$2:$A$32,Valores!$A31,DICIEMBRE!$H$2:$H$32)+SUMIF(DICIEMBRE!$A$2:$A$32,Valores!$A31,DICIEMBRE!$L$2:$L$32)","v":0},0]
[23,{"$f":"SUMIF(ENERO!$A$2:$A$32,Valores!$A32,ENERO!$H$2:$H$32)+SUMIF(ENERO!$A$2:$A$32,Valores!$A32,ENERO!$L$2:$L$32)","v":0},{"$f":"SUMIF(FEBRERO!$A$2:$A$32,Valores!$A32,FEBRERO!$H$2:$H$29)+SUMIF(FEBRERO!$A$2:$A$32,Valores!$A32,FEBRERO!$L$2:$L$32)","v":0},{"$f":"SUMIF(MARZO!$A$2:$A$32,Valores!$A32,MARZO!$H$2:$H$32)+SUMIF(MARZO!$A$2:$A$32,Valores!$A32,MARZO!$L$2:$L$32)","v":0},{"$f":"SUMIF(ABRIL!$A$2:$A$32,Valores!$A32,ABRIL!$H$2:$H$31)+SUMIF(ABRIL!$A$2:$A$32,Valores!$A32,ABRIL!$L$2:$L$32)","v":0},{"$f":"SUMIF(MAYO!$A$2:$A$32,Valores!$A32,MAYO!$H$2:$H$32)+SUMIF(MAYO!$A$2:$A$32,Valores!$A32,MAYO!$L$2:$L$32)","v":0},{"$f":"SUMIF(JUNIO!$A$2:$A$32,Valores!$A32,JUNIO!$H$2:$H$31)+SUMIF(JUNIO!$A$2:$A$32,Valores!$A32,JUNIO!$L$2:$L$32)","v":0},{"$f":"SUMIF(JULIO!$A$2:$A$32,Valores!$A32,JULIO!$H$2:$H$32)+SUMIF(JULIO!$A$2:$A$32,Valores!$A32,JULIO!$L$2:$L$32)","v":0},{"$f":"SUMIF(AGOSTO!$A$2:$A$32,Valores!$A32,AGOSTO!$H$2:$H$32)+SUMIF(AGOSTO!$A$2:$A$32,Valores!$A32,AGOSTO!$L$2:$L$32)","v":0},{"$f":"SUMIF(SEPTIEMBRE!$A$2:$A$32,Valores!$A32,SEPTIEMBRE!$H$2:$H$31)+SUMIF(SEPTIEMBRE!$A$2:$A$32,Valores!$A32,SEPTIEMBRE!$L$2:$L$32)","v":0},{"$f":"SUMIF(OCTUBRE!$A$2:$A$32,Valores!$A32,OCTUBRE!$H$2:$H$32)+SUMIF(OCTUBRE!$A$2:$A$32,Valores!$A32,OCTUBRE!$L$2:$L$32)","v":0},{"$f":"SUMIF(NOVIEMBRE!$A$2:$A$32,Valores!$A32,NOVIEMBRE!$H$2:$H$31)+SUMIF(NOVIEMBRE!$A$2:$A$32,Valores!$A32,NOVIEMBRE!$L$2:$L$32)","v":0},{"$f":"SUMIF(DICIEMBRE!$A$2:$A$32,Valores!$A32,DICIEMBRE!$H$2:$H$32)+SUMIF(DICIEMBRE!$A$2:$A$32,Valores!$A32,DICIEMBRE!$L$2:$L$32)","v":0},0]
[24,{"$f":"SUMIF(ENERO!$A$2:$A$32,Valores!$A33,ENERO!$H$2:$H$32)+SUMIF(ENERO!$A$2:$A$32,Valores!$A33,ENERO!$L$2:$L$32)","v":0},{"$f":"SUMIF(FEBRERO!$A$2:$A$32,Valores!$A33,FEBRERO!$H$2:$H$29)+SUMIF(FEBRERO!$A$2:$A$32,Valores!$A33,FEBRERO!$L$2:$L$32)","v":0},{"$f":"SUMIF(MARZO!$A$2:$A$32,Valores!$A33,MARZO!$H$2:$H$32)+SUMIF(MARZO!$A$2:$A$32,Valores!$A33,MARZO!$L$2:$L$32)","v":0},{"$f":"SUMIF(ABRIL!$A$2:$A$32,Valores!$A33,ABRIL!$H$2:$H$31)+SUMIF(ABRIL!$A$2:$A$32,Valores!$A33,ABRIL!$L$2:$L$32)","v":0},{"$f":"SUMIF(MAYO!$A$2:$A$32,Valores!$A33,MAYO!$H$2:$H$32)+SUMIF(MAYO!$A$2:$A$32,Valores!$A33,MAYO!$L$2:$L$32)","v":0},{"$f":"SUMIF(JUNIO!$A$2:$A$32,Valores!$A33,JUNIO!$H$2:$H$31)+SUMIF(JUNIO!$A$2:$A$32,Valores!$A33,JUNIO!$L$2:$L$32)","v":0},{"$f":"SUMIF(JULIO!$A$2:$A$32,Valores!$A33,JULIO!$H$2:$H$32)+SUMIF(JULIO!$A$2:$A$32,Valores!$A33,JULIO!$L$2:$L$32)","v":0},{"$f":"SUMIF(AGOSTO!$A$2:$A$32,Valores!$A33,AGOSTO!$H$2:$H$32)+SUMIF(AGOSTO!$A$2:$A$32,Valores!$A33,AGOSTO!$L$2:$L$32)","v":0},{"$f":"SUMIF(SEPTIEMBRE!$A$2:$A$32,Valores!$A33,SEPTIEMBRE!$H$2:$H$31)+SUMIF(SEPTIEMBRE!$A$2:$A$32,Valores!$A33,SEPTIEMBRE!$L$2:$L$32)","v":0},{"$f":"SUMIF(OCTUBRE!$A$2:$A$32,Valores!$A33,OCTUBRE!$H$2:$H$32)+SUMIF(OCTUBRE!$A$2:$A$32,Valores!$A33,OCTUBRE!$L$2:$L$32)","v":0},{"$f":"SUMIF(NOVIEMBRE!$A$2:$A$32,Valores!$A33,NOVIEMBRE!$H$2:$H$31)+SUMIF(NOVIEMBRE!$A$2:$A$32,Valores!$A33,NOVIEMBRE!$L$2:$L$32)","v":0},{"$f":"SUMIF(DICIEMBRE!$A$2:$A$32,Valores!$A33,DICIEMBRE!$H$2:$H$32)+SUMIF(DICIEMBRE!$A$2:$A$32,Valores!$A33,DICIEMBRE!$L$2:$L$32)","v":0},0]
[25,{"$f":"SUMIF(ENERO!$A$2:$A$32,Valores!$A34,ENERO!$H$2:$H$32)+SUMIF(ENERO!$A$2:$A$32,Valores!$A34,ENERO!$L$2:$L$32)","v":0},{"$f":"SUMIF(FEBRERO!$A$2:$A$32,Valores!$A34,FEBRERO!$H$2:$H$29)+SUMIF(FEBRERO!$A$2:$A$32,Valores!$A34,FEBRERO!$L$2:$L$32)","v":0},{"$f":"SUMIF(MARZO!$A$2:$A$32,Valores!$A34,MARZO!$H$2:$H$32)+SUMIF(MARZO!$A$2:$A$32,Valores!$A34,MARZO!$L$2:$L$32)","v":0},{"$f":"SUMIF(ABRIL!$A$2:$A$32,Valores!$A34,ABRIL!$H$2:$H$31)+SUMIF(ABRIL!$A$2:$A$32,Valores!$A34,ABRIL!$L$2:$L$32)","v":0},{"$f":"SUMIF(MAYO!$A$2:$A$32,Valores!$A34,MAYO!$H$2:$H$32)+SUMIF(MAYO!$A$2:$A$32,Valores!$A34,MAYO!$L$2:$L$32)","v":0},{"$f":"SUMIF(JUNIO!$A$2:$A$32,Valores!$A34,JUNIO!$H$2:$H$31)+SUMIF(JUNIO!$A$2:$A$32,Valores!$A34,JUNIO!$L$2:$L$32)","v":0},{"$f":"SUMIF(JULIO!$A$2:$A$32,Valores!$A34,JULIO!$H$2:$H$32)+SUMIF(JULIO!$A$2:$A$32,Valores!$A34,JULIO!$L$2:$L$32)","v":0},{"$f":"SUMIF(AGOSTO!$A$2:$A$32,Valores!$A34,AGOSTO!$H$2:$H$32)+SUMIF(AGOSTO!$A$2:$A$32,Valores!$A34,AGOSTO!$L$2:$L$32)","v":0},{"$f":"SUMIF(SEPTIEMBRE!$A$2:$A$32,Valores!$A34,SEPTIEMBRE!$H$2:$H$31)+SUMIF(SEPTIEMBRE!$A$2:$A$32,Valores!$A34,SEPTIEMBRE!$L$2:$L$32)","v":0},{"$f":"SUMIF(OCTUBRE!$A$2:$A$32,Valores!$A34,OCTUBRE!$H$2:$H$32)+SUMIF(OCTUBRE!$A$2:$A$32,Valores!$A34,OCTUBRE!$L$2:$L$32)","v":0},{"$f":"SUMIF(NOVIEMBRE!$A$2:$A$32,Valores!$A34,NOVIEMBRE!$H$2:$H$31)+SUMIF(NOVIEMBRE!$A$2:$A$32,Valores!$A34,NOVIEMBRE!$L$2:$L$32)","v":0},{"$f":"SUMIF(DICIEMBRE!$A$2:$A$32,Valores!$A34,DICIEMBRE!$H$2:$H$32)+SUMIF(DICIEMBRE!$A$2:$A$32,Valores!$A34,DICIEMBRE!$L$2:$L$32)","v":0},0]
[26,{"$f":"SUMIF(ENERO!$A$2:$A$32,Valores!$A35,ENERO!$H$2:$H$32)+SUMIF(ENERO!$A$2:$A$32,Valores!$A35,ENERO!$L$2:$L$32)","v":0},{"$f":"SUMIF(FEBRERO!$A$2:$A$32,Valores!$A35,FEBRERO!$H$2:$H$29)+SUMIF(FEBRERO!$A$2:$A$32,Valores!$A35,FEBRERO!$L$2:$L$32)","v":0},{"$f":"SUMIF(MARZO!$A$2:$A$32,Valores!$A35,MARZO!$H$2:$H$32)+SUMIF(MARZO!$A$2:$A$32,Valores!$A35,MARZO!$L$2:$L$32)","v":0},{"$f":"SUMIF(ABRIL!$A$2:$A$32,Valores!$A35,ABRIL!$H$2:$H$31)+SUMIF(ABRIL!$A$2:$A$32,Valores!$A35,ABRIL!$L$2:$L$32)","v":0},{"$f":"SUMIF(MAYO!$A$2:$A$32,Valores!$A35,MAYO!$H$2:$H$32)+SUMIF(MAYO!$A$2:$A$32,Valores!$A35,MAYO!$L$2:$L$32)","v":0},{"$f":"SUMIF(JUNIO!$A$2:$A$32,Valores!$A35,JUNIO!$H$2:$H$31)+SUMIF(JUNIO!$A$2:$A$32,Valores!$A35,JUNIO!$L$2:$L$32)","v":0},{"$f":"SUMIF(JULIO!$A$2:$A$32,Valores!$A35,JULIO!$H$2:$H$32)+SUMIF(JULIO!$A$2:$A$32,Valores!$A35,JULIO!$L$2:$L$32)","v":0},{"$f":"SUMIF(AGOSTO!$A$2:$A$32,Valores!$A35,AGOSTO!$H$2:$H$32)+SUMIF(AGOSTO!$A$2:$A$32,Valores!$A35,AGOSTO!$L$2:$L$32)","v":0},{"$f":"SUMIF(SEPTIEMBRE!$A$2:$A$32,Valores!$A35,SEPTIEMBRE!$H$2:$H$31)+SUMIF(SEPTIEMBRE!$A$2:$A$32,Valores!$A35,SEPTIEMBRE!$L$2:$L$32)","v":0},{"$f":"SUMIF(OCTUBRE!$A$2:$A$32,Valores!$A35,OCTUBRE!$H$2:$H$32)+SUMIF(OCTUBRE!$A$2:$A$32,Valores!$A35,OCTUBRE!$L$2:$L$32)","v":0},{"$f":"SUMIF(NOVIEMBRE!$A$2:$A$32,Valores!$A35,NOVIEMBRE!$H$2:$H$31)+SUMIF(NOVIEMBRE!$A$2:$A$32,Valores!$A35,NOVIEMBRE!$L$2:$L$32)","v":0},{"$f":"SUMIF(DICIEMBRE!$A$2:$A$32,Valores!$A35,DICIEMBRE!$H$2:$H$32)+SUMIF(DICIEMBRE!$A$2:$A$32,Valores!$A35,DICIEMBRE!$L$2:$L$32)","v":0},0]
[27,{"$f":"SUMIF(ENERO!$A$2:$A$32,Valores!$A36,ENERO!$H$2:$H$32)+SUMIF(ENERO!$A$2:$A$32,Valores!$A36,ENERO!$L$2:$L$32)","v":0},{"$f":"SUMIF(FEBRERO!$A$2:$A$32,Valores!$A36,FEBRERO!$H$2:$H$29)+SUMIF(FEBRERO!$A$2:$A$32,Valores!$A36,FEBRERO!$L$2:$L$32)","v":0},{"$f":"SUMIF(MARZO!$A$2:$A$32,Valores!$A36,MARZO!$H$2:$H$32)+SUMIF(MARZO!$A$2:$A$32,Valores!$A36,MARZO!$L$2:$L$32)","v":0},{"$f":"SUMIF(ABRIL!$A$2:$A$32,Valores!$A36,ABRIL!$H$2:$H$31)+SUMIF(ABRIL!$A$2:$A$32,Valores!$A36,ABRIL!$L$2:$L$32)","v":0},{"$f":"SUMIF(MAYO!$A$2:$A$32,Valores!$A36,MAYO!$H$2:$H$32)+SUMIF(MAYO!$A$2:$A$32,Valores!$A36,MAYO!$L$2:$L$32)","v":0},{"$f":"SUMIF(JUNIO!$A$2:$A$32,Valores!$A36,JUNIO!$H$2:$H$31)+SUMIF(JUNIO!$A$2:$A$32,Valores!$A36,JUNIO!$L$2:$L$32)","v":0},{"$f":"SUMIF(JULIO!$A$2:$A$32,Valores!$A36,JULIO!$H$2:$H$32)+SUMIF(JULIO!$A$2:$A$32,Valores!$A36,JULIO!$L$2:$L$32)","v":0},{"$f":"SUMIF(AGOSTO!$A$2:$A$32,Valores!$A36,AGOSTO!$H$2:$H$32)+SUMIF(AGOSTO!$A$2:$A$32,Valores!$A36,AGOSTO!$L$2:$L$32)","v":0},{"$f":"SUMIF(SEPTIEMBRE!$A$2:$A$32,Valores!$A36,SEPTIEMBRE!$H$2:$H$31)+SUMIF(SEPTIEMBRE!$A$2:$A$32,Valores!$A36,SEPTIEMBRE!$L$2:$L$32)","v":0},{"$f":"SUMIF(OCTUBRE!$A$2:$A$32,Valores!$A36,OCTUBRE!$H$2:$H$32)+SUMIF(OCTUBRE!$A$2:$A$32,Valores!$A36,OCTUBRE!$L$2:$L$32)","v":0},{"$f":"SUMIF(NOVIEMBRE!$A$2:$A$32,Valores!$A36,NOVIEMBRE!$H$2:$H$31)+SUMIF(NOVIEMBRE!$A$2:$A$32,Valores!$A36,NOVIEMBRE!$L$2:$L$32)","v":0},{"$f":"SUMIF(DICIEMBRE!$A$2:$A$32,Valores!$A36,DICIEMBRE!$H$2:$H$32)+SUMIF(DICIEMBRE!$A$2:$A$32,Valores!$A36,DICIEMBRE!$L$2:$L$32)","v":0},0]
[28,{"$f":"SUMIF(ENERO!$A$2:$A$32,Valores!$A37,ENERO!$H$2:$H$32)+SUMIF(ENERO!$A$2:$A$32,Valores!$A37,ENERO!$L$2:$L$32)","v":0},{"$f":"SUMIF(FEBRERO!$A$2:$A$32,Valores!$A37,FEBRERO!$H$2:$H$29)+SUMIF(FEBRERO!$A$2:$A$32,Valores!$A37,FEBRERO!$L$2:$L$32)","v":0},{"$f":"SUMIF(MARZO!$A$2:$A$32,Valores!$A37,MARZO!$H$2:$H$32)+SUMIF(MARZO!$A$2:$A$32,Valores!$A37,MARZO!$L$2:$L$32)","v":0},{"$f":"SUMIF(ABRIL!$A$2:$A$32,Valores!$A37,ABRIL!$H$2:$H$31)+SUMIF(ABRIL!$A$2:$A$32,Valores!$A37,ABRIL!$L$2:$L$32)","v":0},{"$f":"SUMIF(MAYO!$A$2:$A$32,Valores!$A37,MAYO!$H$2:$H$32)+SUMIF(MAYO!$A$2:$A$32,Valores!$A37,MAYO!$L$2:$L$32)","v":0},{"$f":"SUMIF(JUNIO!$A$2:$A$32,Valores!$A37,JUNIO!$H$2:$H$31)+SUMIF(JUNIO!$A$2:$A$32,Valores!$A37,JUNIO!$L$2:$L$32)","v":0},{"$f":"SUMIF(JULIO!$A$2:$A$32,Valores!$A37,JULIO!$H$2:$H$32)+SUMIF(JULIO!$A$2:$A$32,Valores!$A37,JULIO!$L$2:$L$32)","v":0},{"$f":"SUMIF(AGOSTO!$A$2:$A$32,Valores!$A37,AGOSTO!$H$2:$H$32)+SUMIF(AGOSTO!$A$2:$A$32,Valores!$A37,AGOSTO!$L$2:$L$32)","v":0},{"$f":"SUMIF(SEPTIEMBRE!$A$2:$A$32,Valores!$A37,SEPTIEMBRE!$H$2:$H$31)+SUMIF(SEPTIEMBRE!$A$2:$A$32,Valores!$A37,SEPTIEMBRE!$L$2:$L$32)","v":0},{"$f":"SUMIF(OCTUBRE!$A$2:$A$32,Valores!$A37,OCTUBRE!$H$2:$H$32)+SUMIF(OCTUBRE!$A$2:$A$32,Valores!$A37,OCTUBRE!$L$2:$L$32)","v":0},{"$f":"SUMIF(NOVIEMBRE!$A$2:$A$32,Valores!$A37,NOVIEMBRE!$H$2:$H$31)+SUMIF(NOVIEMBRE!$A$2:$A$32,Valores!$A37,NOVIEMBRE!$L$2:$L$32)","v":0},{"$f":"SUMIF(DICIEMBRE!$A$2:$A$32,Valores!$A37,DICIEMBRE!$H$2:$H$32)+SUMIF(DICIEMBRE!$A$2:$A$32,Valores!$A37,DICIEMBRE!$L$2:$L$32)","v":0},0]
[29,{"$f":"SUMIF(ENERO!$A$2:$A$32,Valores!$A38,ENERO!$H$2:$H$32)+SUMIF(ENERO!$A$2:$A$32,Valores!$A38,ENERO!$L$2:$L$32)","v":0},{"$f":"SUMIF(FEBRERO!$A$2:$A$32,Valores!$A38,FEBRERO!$H$2:$H$29)+SUMIF(FEBRERO!$A$2:$A$32,Valores!$A38,FEBRERO!$L$2:$L$32)","v":0},{"$f":"SUMIF(MARZO!$A$2:$A$32,Valores!$A38,MARZO!$H$2:$H$32)+SUMIF(MARZO!$A$2:$A$32,Valores!$A38,MARZO!$L$2:$L$32)","v":0},{"$f":"SUMIF(ABRIL!$A$2:$A$32,Valores!$A38,ABRIL!$H$2:$H$31)+SUMIF(ABRIL!$A$2:$A$32,Valores!$A38,ABRIL!$L$2:$L$32)","v":0},{"$f":"SUMIF(MAYO!$A$2:$A$32,Valores!$A38,MAYO!$H$2:$H$32)+SUMIF(MAYO!$A$2:$A$32,Valores!$A38,MAYO!$L$2:$L$32)","v":0},{"$f":"SUMIF(JUNIO!$A$2:$A$32,Valores!$A38,JUNIO!$H$2:$H$31)+SUMIF(JUNIO!$A$2:$A$32,Valores!$A38,JUNIO!$L$2:$L$32)","v":0},{"$f":"SUMIF(JULIO!$A$2:$A$32,Valores!$A38,JULIO!$H$2:$H$32)+SUMIF(JULIO!$A$2:$A$32,Valores!$A38,JULIO!$L$2:$L$32)","v":0},{"$f":"SUMIF(AGOSTO!$A$2:$A$32,Valores!$A38,AGOSTO!$H$2:$H$32)+SUMIF(AGOSTO!$A$2:$A$32,Valores!$A38,AGOSTO!$L$2:$L$32)","v":0},{"$f":"SUMIF(SEPTIEMBRE!$A$2:$A$32,Valores!$A38,SEPTIEMBRE!$H$2:$H$31)+SUMIF(SEPTIEMBRE!$A$2:$A$32,Valores!$A38,SEPTIEMBRE!$L$2:$L$32)","v":0},{"$f":"SUMIF(OCTUBRE!$A$2:$A$32,Valores!$A38,OCTUBRE!$H$2:$H$32)+SUMIF(OCTUBRE!$A$2:$A$32,Valores!$A38,OCTUBRE!$L$2:$L$32)","v":0},{"$f":"SUMIF(NOVIEMBRE!$A$2:$A$32,Valores!$A38,NOVIEMBRE!$H$2:$H$31)+SUMIF(NOVIEMBRE!$A$2:$A$32,Valores!$A38,NOVIEMBRE!$L$2:$L$32)","v":0},{"$f":"SUMIF(DICIEMBRE!$A$2:$A$32,Valores!$A38,DICIEMBRE!$H$2:$H$32)+SUMIF(DICIEMBRE!$A$2:$A$32,Valores!$A38,DICIEMBRE!$L$2:$L$32)","v":0},0]
[30,{"$f":"SUMIF(ENERO!$A$2:$A$32,Valores!$A39,ENERO!$H$2:$H$32)+SUMIF(ENERO!$A$2:$A$32,Valores!$A39,ENERO!$L$2:$L$32)","v":0},{"$f":"SUMIF(FEBRERO!$A$2:$A$32,Valores!$A39,FEBRERO!$H$2:$H$29)+SUMIF(FEBRERO!$A$2:$A$32,Valores!$A39,FEBRERO!$L$2:$L$32)","v":0},{"$f":"SUMIF(MARZO!$A$2:$A$32,Valores!$A39,MARZO!$H$2:$H$32)+SUMIF(MARZO!$A$2:$A$32,Valores!$A39,MARZO!$L$2:$L$32)","v":0},{"$f":"SUMIF(ABRIL!$A$2:$A$32,Valores!$A39,ABRIL!$H$2:$H$31)+SUMIF(ABRIL!$A$2:$A$32,Valores!$A39,ABRIL!$L$2:$L$32)","v":0},{"$f":"SUMIF(MAYO!$A$2:$A$32,Valores!$A39,MAYO!$H$2:$H$32)+SUMIF(MAYO!$A$2:$A$32,Valores!$A39,MAYO!$L$2:$L$32)","v":0},{"$f":"SUMIF(JUNIO!$A$2:$A$32,Valores!$A39,JUNIO!$H$2:$H$31)+SUMIF(JUNIO!$A$2:$A$32,Valores!$A39,JUNIO!$L$2:$L$32)","v":0},{"$f":"SUMIF(JULIO!$A$2:$A$32,Valores!$A39,JULIO!$H$2:$H$32)+SUMIF(JULIO!$A$2:$A$32,Valores!$A39,JULIO!$L$2:$L$32)","v":0},{"$f":"SUMIF(AGOSTO!$A$2:$A$32,Valores!$A39,AGOSTO!$H$2:$H$32)+SUMIF(AGOSTO!$A$2:$A$32,Valores!$A39,AGOSTO!$L$2:$L$32)","v":0},{"$f":"SUMIF(SEPTIEMBRE!$A$2:$A$32,Valores!$A39,SEPTIEMBRE!$H$2:$H$31)+SUMIF(SEPTIEMBRE!$A$2:$A$32,Valores!$A39,SEPTIEMBRE!$L$2:$L$32)","v":0},{"$f":"SUMIF(OCTUBRE!$A$2:$A$32,Valores!$A39,OCTUBRE!$H$2:$H$32)+SUMIF(OCTUBRE!$A$2:$A$32,Valores!$A39,OCTUBRE!$L$2:$L$32)","v":0},{"$f":"SUMIF(NOVIEMBRE!$A$2:$A$32,Valores!$A39,NOVIEMBRE!$H$2:$H$31)+SUMIF(NOVIEMBRE!$A$2:$A$32,Valores!$A39,NOVIEMBRE!$L$2:$L$32)","v":0},{"$f":"SUMIF(DICIEMBRE!$A$2:$A$32,Valores!$A39,DICIEMBRE!$H$2:$H$32)+SUMIF(DICIEMBRE!$A$2:$A$32,Valores!$A39,DICIEMBRE!$L$2:$L$32)","v":0},0]
[31,{"$f":"SUMIF(ENERO!$A$2:$A$32,Valores!$A40,ENERO!$H$2:$H$32)+SUMIF(ENERO!$A$2:$A$32,Valores!$A40,ENERO!$L$2:$L$32)","v":0},{"$f":"SUMIF(FEBRERO!$A$2:$A$32,Valores!$A40,FEBRERO!$H$2:$H$29)+SUMIF(FEBRERO!$A$2:$A$32,Valores!$A40,FEBRERO!$L$2:$L$32)","v":0},{"$f":"SUMIF(MARZO!$A$2:$A$32,Valores!$A40,MARZO!$H$2:$H$32)+SUMIF(MARZO!$A$2:$A$32,Valores!$A40,MARZO!$L$2:$L$32)","v":0},{"$f":"SUMIF(ABRIL!$A$2:$A$32,Valores!$A40,ABRIL!$H$2:$H$31)+SUMIF(ABRIL!$A$2:$A$32,Valores!$A40,ABRIL!$L$2:$L$32)","v":0},{"$f":"SUMIF(MAYO!$A$2:$A$32,Valores!$A40,MAYO!$H$2:$H$32)+SUMIF(MAYO!$A$2:$A$32,Valores!$A40,MAYO!$L$2:$L$32)","v":0},{"$f":"SUMIF(JUNIO!$A$2:$A$32,Valores!$A40,JUNIO!$H$2:$H$31)+SUMIF(JUNIO!$A$2:$A$32,Valores!$A40,JUNIO!$L$2:$L$32)","v":0},{"$f":"SUMIF(JULIO!$A$2:$A$32,Valores!$A40,JULIO!$H$2:$H$32)+SUMIF(JULIO!$A$2:$A$32,Valores!$A40,JULIO!$L$2:$L$32)","v":0},{"$f":"SUMIF(AGOSTO!$A$2:$A$32,Valores!$A40,AGOSTO!$H$2:$H$32)+SUMIF(AGOSTO!$A$2:$A$32,Valores!$A40,AGOSTO!$L$2:$L$32)","v":0},{"$f":"SUMIF(SEPTIEMBRE!$A$2:$A$32,Valores!$A40,SEPTIEMBRE!$H$2:$H$31)+SUMIF(SEPTIEMBRE!$A$2:$A$32,Valores!$A40,SEPTIEMBRE!$L$2:$L$32)","v":0},{"$f":"SUMIF(OCTUBRE!$A$2:$A$32,Valores!$A40,OCTUBRE!$H$2:$H$32)+SUMIF(OCTUBRE!$A$2:$A$32,Valores!$A40,OCTUBRE!$L$2:$L$32)","v":0},{"$f":"SUMIF(NOVIEMBRE!$A$2:$A$32,Valores!$A40,NOVIEMBRE!$H$2:$H$31)+SUMIF(NOVIEMBRE!$A$2:$A$32,Valores!$A40,NOVIEMBRE!$L$2:$L$32)","v":0},{"$f":"SUMIF(DICIEMBRE!$A$2:$A$32,Valores!$A40,DICIEMBRE!$H$2:$H$32)+SUMIF(DICIEMBRE!$A$2:$A$32,Valores!$A40,DICIEMBRE!$L$2:$L$32)","v":0},0]
[32,{"$f":"SUMIF(ENERO!$A$2:$A$32,Valores!$A41,ENERO!$H$2:$H$32)+SUMIF(ENERO!$A$2:$A$32,Valores!$A41,ENERO!$L$2:$L$32)","v":0},{"$f":"SUMIF(FEBRERO!$A$2:$A$32,Valores!$A41,FEBRERO!$H$2:$H$29)+SUMIF(FEBRERO!$A$2:$A$32,Valores!$A41,FEBRERO!$L$2:$L$32)","v":0},{"$f":"SUMIF(MARZO!$A$2:$A$32,Valores!$A41,MARZO!$H$2:$H$32)+SUMIF(MARZO!$A$2:$A$32,Valores!$A41,MARZO!$L$2:$L$32)","v":0},{"$f":"SUMIF(ABRIL!$A$2:$A$32,Valores!$A41,ABRIL!$H$2:$H$31)+SUMIF(ABRIL!$A$2:$A$32,Valores!$A41,ABRIL!$L$2:$L$32)","v":0},{"$f":"SUMIF(MAYO!$A$2:$A$32,Valores!$A41,MAYO!$H$2:$H$32)+SUMIF(MAYO!$A$2:$A$32,Valores!$A41,MAYO!$L$2:$L$32)","v":0},{"$f":"SUMIF(JUNIO!$A$2:$A$32,Valores!$A41,JUNIO!$H$2:$H$31)+SUMIF(JUNIO!$A$2:$A$32,Valores!$A41,JUNIO!$L$2:$L$32)","v":0},{"$f":"SUMIF(JULIO!$A$2:$A$32,Valores!$A41,JULIO!$H$2:$H$32)+SUMIF(JULIO!$A$2:$A$32,Valores!$A41,JULIO!$L$2:$L$32)","v":0},{"$f":"SUMIF(AGOSTO!$A$2:$A$32,Valores!$A41,AGOSTO!$H$2:$H$32)+SUMIF(AGOSTO!$A$2:$A$32,Valores!$A41,AGOSTO!$L$2:$L$32)","v":0},{"$f":"SUMIF(SEPTIEMBRE!$A$2:$A$32,Valores!$A41,SEPTIEMBRE!$H$2:$H$31)+SUMIF(SEPTIEMBRE!$A$2:$A$32,Valores!$A41,SEPTIEMBRE!$L$2:$L$32)","v":0},{"$f":"SUMIF(OCTUBRE!$A$2:$A$32,Valores!$A41,OCTUBRE!$H$2:$H$32)+SUMIF(OCTUBRE!$A$2:$A$32,Valores!$A41,OCTUBRE!$L$2:$L$32)","v":0},{"$f":"SUMIF(NOVIEMBRE!$A$2:$A$32,Valores!$A41,NOVIEMBRE!$H$2:$H$31)+SUMIF(NOVIEMBRE!$A$2:$A$32,Valores!$A41,NOVIEMBRE!$L$2:$L$32)","v":0},{"$f":"SUMIF(DICIEMBRE!$A$2:$A$32,Valores!$A41,DICIEMBRE!$H$2:$H$32)+SUMIF(DICIEMBRE!$A$2:$A$32,Valores!$A41,DICIEMBRE!$L$2:$L$32)","v":0},0]
[33,{"$f":"SUMIF(ENERO!$A$2:$A$32,Valores!$A42,ENERO!$H$2:$H$32)+SUMIF(ENERO!$A$2:$A$32,Valores!$A42,ENERO!$L$2:$L$32)","v":0},{"$f":"SUMIF(FEBRERO!$A$2:$A$32,Valores!$A42,FEBRERO!$H$2:$H$29)+SUMIF(FEBRERO!$A$2:$A$32,Valores!$A42,FEBRERO!$L$2:$L$32)","v":0},{"$f":"SUMIF(MARZO!$A$2:$A$32,Valores!$A42,MARZO!$H$2:$H$32)+SUMIF(MARZO!$A$2:$A$32,Valores!$A42,MARZO!$L$2:$L$32)","v":0},{"$f":"SUMIF(ABRIL!$A$2:$A$32,Valores!$A42,ABRIL!$H$2:$H$31)+SUMIF(ABRIL!$A$2:$A$32,Valores!$A42,ABRIL!$L$2:$L$32)","v":0},{"$f":"SUMIF(MAYO!$A$2:$A$32,Valores!$A42,MAYO!$H$2:$H$32)+SUMIF(MAYO!$A$2:$A$32,Valores!$A42,MAYO!$L$2:$L$32)","v":0},{"$f":"SUMIF(JUNIO!$A$2:$A$32,Valores!$A42,JUNIO!$H$2:$H$31)+SUMIF(JUNIO!$A$2:$A$32,Valores!$A42,JUNIO!$L$2:$L$32)","v":0},{"$f":"SUMIF(JULIO!$A$2:$A$32,Valores!$A42,JULIO!$H$2:$H$32)+SUMIF(JULIO!$A$2:$A$32,Valores!$A42,JULIO!$L$2:$L$32)","v":0},{"$f":"SUMIF(AGOSTO!$A$2:$A$32,Valores!$A42,AGOSTO!$H$2:$H$32)+SUMIF(AGOSTO!$A$2:$A$32,Valores!$A42,AGOSTO!$L$2:$L$32)","v":0},{"$f":"SUMIF(SEPTIEMBRE!$A$2:$A$32,Valores!$A42,SEPTIEMBRE!$H$2:$H$31)+SUMIF(SEPTIEMBRE!$A$2:$A$32,Valores!$A42,SEPTIEMBRE!$L$2:$L$32)","v":0},{"$f":"SUMIF(OCTUBRE!$A$2:$A$32,Valores!$A42,OCTUBRE!$H$2:$H$32)+SUMIF(OCTUBRE!$A$2:$A$32,Valores!$A42,OCTUBRE!$L$2:$L$32)","v":0},{"$f":"SUMIF(NOVIEMBRE!$A$2:$A$32,Valores!$A42,NOVIEMBRE!$H$2:$H$31)+SUMIF(NOVIEMBRE!$A$2:$A$32,Valores!$A42,NOVIEMBRE!$L$2:$L$32)","v":0},{"$f":"SUMIF(DICIEMBRE!$A$2:$A$32,Valores!$A42,DICIEMBRE!$H$2:$H$32)+SUMIF(DICIEMBRE!$A$2:$A$32,Valores!$A42,DICIEMBRE!$L$2:$L$32)","v":0},0]
[34,{"$f":"SUMIF(ENERO!$A$2:$A$32,Valores!$A43,ENERO!$H$2:$H$32)+SUMIF(ENERO!$A$2:$A$32,Valores!$A43,ENERO!$L$2:$L$32)","v":0},{"$f":"SUMIF(FEBRERO!$A$2:$A$32,Valores!$A43,FEBRERO!$H$2:$H$29)+SUMIF(FEBRERO!$A$2:$A$32,Valores!$A43,FEBRERO!$L$2:$L$32)","v":0},{"$f":"SUMIF(MARZO!$A$2:$A$32,Valores!$A43,MARZO!$H$2:$H$32)+SUMIF(MARZO!$A$2:$A$32,Valores!$A43,MARZO!$L$2:$L$32)","v":0},{"$f":"SUMIF(ABRIL!$A$2:$A$32,Valores!$A43,ABRIL!$H$2:$H$31)+SUMIF(ABRIL!$A$2:$A$32,Valores!$A43,ABRIL!$L$2:$L$32)","v":0},{"$f":"SUMIF(MAYO!$A$2:$A$32,Valores!$A43,MAYO!$H$2:$H$32)+SUMIF(MAYO!$A$2:$A$32,Valores!$A43,MAYO!$L$2:$L$32)","v":0},{"$f":"SUMIF(JUNIO!$A$2:$A$32,Valores!$A43,JUNIO!$H$2:$H$31)+SUMIF(JUNIO!$A$2:$A$32,Valores!$A43,JUNIO!$L$2:$L$32)","v":0},{"$f":"SUMIF(JULIO!$A$2:$A$32,Valores!$A43,JULIO!$H$2:$H$32)+SUMIF(JULIO!$A$2:$A$32,Valores!$A43,JULIO!$L$2:$L$32)","v":0},{"$f":"SUMIF(AGOSTO!$A$2:$A$32,Valores!$A43,AGOSTO!$H$2:$H$32)+SUMIF(AGOSTO!$A$2:$A$32,Valores!$A43,AGOSTO!$L$2:$L$32)","v":0},{"$f":"SUMIF(SEPTIEMBRE!$A$2:$A$32,Valores!$A43,SEPTIEMBRE!$H$2:$H$31)+SUMIF(SEPTIEMBRE!$A$2:$A$32,Valores!$A43,SEPTIEMBRE!$L$2:$L$32)","v":0},{"$f":"SUMIF(OCTUBRE!$A$2:$A$32,Valores!$A43,OCTUBRE!$H$2:$H$32)+SUMIF(OCTUBRE!$A$2:$A$32,Valores!$A43,OCTUBRE!$L$2:$L$32)","v":0},{"$f":"SUMIF(NOVIEMBRE!$A$2:$A$32,Valores!$A43,NOVIEMBRE!$H$2:$H$31)+SUMIF(NOVIEMBRE!$A$2:$A$32,Valores!$A43,NOVIEMBRE!$L$2:$L$32)","v":0},{"$f":"SUMIF(DICIEMBRE!$A$2:$A$32,Valores!$A43,DICIEMBRE!$H$2:$H$32)+SUMIF(DICIEMBRE!$A$2:$A$32,Valores!$A43,DICIEMBRE!$L$2:$L$32)","v":0},0]
[35,{"$f":"SUMIF(ENERO!$A$2:$A$32,Valores!$A44,ENERO!$H$2:$H$32)+SUMIF(ENERO!$A$2:$A$32,Valores!$A44,ENERO!$L$2:$L$32)","v":0},{"$f":"SUMIF(FEBRERO!$A$2:$A$32,Valores!$A44,FEBRERO!$H$2:$H$29)+SUMIF(FEBRERO!$A$2:$A$32,Valores!$A44,FEBRERO!$L$2:$L$32)","v":0},{"$f":"SUMIF(MARZO!$A$2:$A$32,Valores!$A44,MARZO!$H$2:$H$32)+SUMIF(MARZO!$A$2:$A$32,Valores!$A44,MARZO!$L$2:$L$32)","v":0},{"$f":"SUMIF(ABRIL!$A$2:$A$32,Valores!$A44,ABRIL!$H$2:$H$31)+SUMIF(ABRIL!$A$2:$A$32,Valores!$A44,ABRIL!$L$2:$L$32)","v":0},{"$f":"SUMIF(MAYO!$A$2:$A$32,Valores!$A44,MAYO!$H$2:$H$32)+SUMIF(MAYO!$A$2:$A$32,Valores!$A44,MAYO!$L$2:$L$32)","v":0},{"$f":"SUMIF(JUNIO!$A$2:$A$32,Valores!$A44,JUNIO!$H$2:$H$31)+SUMIF(JUNIO!$A$2:$A$32,Valores!$A44,JUNIO!$L$2:$L$32)","v":0},{"$f":"SUMIF(JULIO!$A$2:$A$32,Valores!$A44,JULIO!$H$2:$H$32)+SUMIF(JULIO!$A$2:$A$32,Valores!$A44,JULIO!$L$2:$L$32)","v":0},{"$f":"SUMIF(AGOSTO!$A$2:$A$32,Valores!$A44,AGOSTO!$H$2:$H$32)+SUMIF(AGOSTO!$A$2:$A$32,Valores!$A44,AGOSTO!$L$2:$L$32)","v":0},{"$f":"SUMIF(SEPTIEMBRE!$A$2:$A$32,Valores!$A44,SEPTIEMBRE!$H$2:$H$31)+SUMIF(SEPTIEMBRE!$A$2:$A$32,Valores!$A44,SEPTIEMBRE!$L$2:$L$32)","v":0},{"$f":"SUMIF(OCTUBRE!$A$2:$A$32,Valores!$A44,OCTUBRE!$H$2:$H$32)+SUMIF(OCTUBRE!$A$2:$A$32,Valores!$A44,OCTUBRE!$L$2:$L$32)","v":0},{"$f":"SUMIF(NOVIEMBRE!$A$2:$A$32,Valores!$A44,NOVIEMBRE!$H$2:$H$31)+SUMIF(NOVIEMBRE!$A$2:$A$32,Valores!$A44,NOVIEMBRE!$L$2:$L$32)","v":0},{"$f":"SUMIF(DICIEMBRE!$A$2:$A$32,Valores!$A44,DICIEMBRE!$H$2:$H$32)+SUMIF(DICIEMBRE!$A$2:$A$32,Valores!$A44,DICIEMBRE!$L$2:$L$32)","v":0},0]
[36,{"$f":"SUMIF(ENERO!$A$2:$A$32,Valores!$A45,ENERO!$H$2:$H$32)+SUMIF(ENERO!$A$2:$A$32,Valores!$A45,ENERO!$L$2:$L$32)","v":0},{"$f":"SUMIF(FEBRERO!$A$2:$A$32,Valores!$A45,FEBRERO!$H$2:$H$29)+SUMIF(FEBRERO!$A$2:$A$32,Valores!$A45,FEBRERO!$L$2:$L$32)","v":0},{"$f":"SUMIF(MARZO!$A$2:$A$32,Valores!$A45,MARZO!$H$2:$H$32)+SUMIF(MARZO!$A$2:$A$32,Valores!$A45,MARZO!$L$2:$L$32)","v":0},{"$f":"SUMIF(ABRIL!$A$2:$A$32,Valores!$A45,ABRIL!$H$2:$H$31)+SUMIF(ABRIL!$A$2:$A$32,Valores!$A45,ABRIL!$L$2:$L$32)","v":0},{"$f":"SUMIF(MAYO!$A$2:$A$32,Valores!$A45,MAYO!$H$2:$H$32)+SUMIF(MAYO!$A$2:$A$32,Valores!$A45,MAYO!$L$2:$L$32)","v":0},{"$f":"SUMIF(JUNIO!$A$2:$A$32,Valores!$A45,JUNIO!$H$2:$H$31)+SUMIF(JUNIO!$A$2:$A$32,Valores!$A45,JUNIO!$L$2:$L$32)","v":0},{"$f":"SUMIF(JULIO!$A$2:$A$32,Valores!$A45,JULIO!$H$2:$H$32)+SUMIF(JULIO!$A$2:$A$32,Valores!$A45,JULIO!$L$2:$L$32)","v":0},{"$f":"SUMIF(AGOSTO!$A$2:$A$32,Valores!$A45,AGOSTO!$H$2:$H$32)+SUMIF(AGOSTO!$A$2:$A$32,Valores!$A45,AGOSTO!$L$2:$L$32)","v":0},{"$f":"SUMIF(SEPTIEMBRE!$A$2:$A$32,Valores!$A45,SEPTIEMBRE!$H$2:$H$31)+SUMIF(SEPTIEMBRE!$A$2:$A$32,Valores!$A45,SEPTIEMBRE!$L$2:$L$32)","v":0},{"$f":"SUMIF(OCTUBRE!$A$2:$A$32,Valores!$A45,OCTUBRE!$H$2:$H$32)+SUMIF(OCTUBRE!$A$2:$A$32,Valores!$A45,OCTUBRE!$L$2:$L$32)","v":0},{"$f":"SUMIF(NOVIEMBRE!$A$2:$A$32,Valores!$A45,NOVIEMBRE!$H$2:$H$31)+SUMIF(NOVIEMBRE!$A$2:$A$32,Valores!$A45,NOVIEMBRE!$L$2:$L$32)","v":0},{"$f":"SUMIF(DICIEMBRE!$A$2:$A$32,Valores!$A45,DICIEMBRE!$H$2:$H$32)+SUMIF(DICIEMBRE!$A$2:$A$32,Valores!$A45,DICIEMBRE!$L$2:$L$32)","v":0},0]
[37,{"$f":"SUMIF(ENERO!$A$2:$A$32,Valores!$A46,ENERO!$H$2:$H$32)+SUMIF(ENERO!$A$2:$A$32,Valores!$A46,ENERO!$L$2:$L$32)","v":0},{"$f":"SUMIF(FEBRERO!$A$2:$A$32,Valores!$A46,FEBRERO!$H$2:$H$29)+SUMIF(FEBRERO!$A$2:$A$32,Valores!$A46,FEBRERO!$L$2:$L$32)","v":0},{"$f":"SUMIF(MARZO!$A$2:$A$32,Valores!$A46,MARZO!$H$2:$H$32)+SUMIF(MARZO!$A$2:$A$32,Valores!$A46,MARZO!$L$2:$L$32)","v":0},{"$f":"SUMIF(ABRIL!$A$2:$A$32,Valores!$A46,ABRIL!$H$2:$H$31)+SUMIF(ABRIL!$A$2:$A$32,Valores!$A46,ABRIL!$L$2:$L$32)","v":0},{"$f":"SUMIF(MAYO!$A$2:$A$32,Valores!$A46,MAYO!$H$2:$H$32)+SUMIF(MAYO!$A$2:$A$32,Valores!$A46,MAYO!$L$2:$L$32)","v":0},{"$f":"SUMIF(JUNIO!$A$2:$A$32,Valores!$A46,JUNIO!$H$2:$H$31)+SUMIF(JUNIO!$A$2:$A$32,Valores!$A46,JUNIO!$L$2:$L$32)","v":0},{"$f":"SUMIF(JULIO!$A$2:$A$32,Valores!$A46,JULIO!$H$2:$H$32)+SUMIF(JULIO!$A$2:$A$32,Valores!$A46,JULIO!$L$2:$L$32)","v":0},{"$f":"SUMIF(AGOSTO!$A$2:$A$32,Valores!$A46,AGOSTO!$H$2:$H$32)+SUMIF(AGOSTO!$A$2:$A$32,Valores!$A46,AGOSTO!$L$2:$L$32)","v":0},{"$f":"SUMIF(SEPTIEMBRE!$A$2:$A$32,Valores!$A46,SEPTIEMBRE!$H$2:$H$31)+SUMIF(SEPTIEMBRE!$A$2:$A$32,Valores!$A46,SEPTIEMBRE!$L$2:$L$32)","v":0},{"$f":"SUMIF(OCTUBRE!$A$2:$A$32,Valores!$A46,OCTUBRE!$H$2:$H$32)+SUMIF(OCTUBRE!$A$2:$A$32,Valores!$A46,OCTUBRE!$L$2:$L$32)","v":0},{"$f":"SUMIF(NOVIEMBRE!$A$2:$A$32,Valores!$A46,NOVIEMBRE!$H$2:$H$31)+SUMIF(NOVIEMBRE!$A$2:$A$32,Valores!$A46,NOVIEMBRE!$L$2:$L$32)","v":0},{"$f":"SUMIF(DICIEMBRE!$A$2:$A$32,Valores!$A46,DICIEMBRE!$H$2:$H$32)+SUMIF(DICIEMBRE!$A$2:$A$32,Valores!$A46,DICIEMBRE!$L$2:$L$32)","v":0},0]
[38,{"$f":"SUMIF(ENERO!$A$2:$A$32,Valores!$A47,ENERO!$H$2:$H$32)+SUMIF(ENERO!$A$2:$A$32,Valores!$A47,ENERO!$L$2:$L$32)","v":0},{"$f":"SUMIF(FEBRERO!$A$2:$A$32,Valores!$A47,FEBRERO!$H$2:$H$29)+SUMIF(FEBRERO!$A$2:$A$32,Valores!$A47,FEBRERO!$L$2:$L$32)","v":0},{"$f":"SUMIF(MARZO!$A$2:$A$32,Valores!$A47,MARZO!$H$2:$H$32)+SUMIF(MARZO!$A$2:$A$32,Valores!$A47,MARZO!$L$2:$L$32)","v":0},{"$f":"SUMIF(ABRIL!$A$2:$A$32,Valores!$A47,ABRIL!$H$2:$H$31)+SUMIF(ABRIL!$A$2:$A$32,Valores!$A47,ABRIL!$L$2:$L$32)","v":0},{"$f":"SUMIF(MAYO!$A$2:$A$32,Valores!$A47,MAYO!$H$2:$H$32)+SUMIF(MAYO!$A$2:$A$32,Valores!$A47,MAYO!$L$2:$L$32)","v":0},{"$f":"SUMIF(JUNIO!$A$2:$A$32,Valores!$A47,JUNIO!$H$2:$H$31)+SUMIF(JUNIO!$A$2:$A$32,Valores!$A47,JUNIO!$L$2:$L$32)","v":0},{"$f":"SUMIF(JULIO!$A$2:$A$32,Valores!$A47,JULIO!$H$2:$H$32)+SUMIF(JULIO!$A$2:$A$32,Valores!$A47,JULIO!$L$2:$L$32)","v":0},{"$f":"SUMIF(AGOSTO!$A$2:$A$32,Valores!$A47,AGOSTO!$H$2:$H$32)+SUMIF(AGOSTO!$A$2:$A$32,Valores!$A47,AGOSTO!$L$2:$L$32)","v":0},{"$f":"SUMIF(SEPTIEMBRE!$A$2:$A$32,Valores!$A47,SEPTIEMBRE!$H$2:$H$31)+SUMIF(SEPTIEMBRE!$A$2:$A$32,Valores!$A47,SEPTIEMBRE!$L$2:$L$32)","v":0},{"$f":"SUMIF(OCTUBRE!$A$2:$A$32,Valores!$A47,OCTUBRE!$H$2:$H$32)+SUMIF(OCTUBRE!$A$2:$A$32,Valores!$A47,OCTUBRE!$L$2:$L$32)","v":0},{"$f":"SUMIF(NOVIEMBRE!$A$2:$A$32,Valores!$A47,NOVIEMBRE!$H$2:$H$31)+SUMIF(NOVIEMBRE!$A$2:$A$32,Valores!$A47,NOVIEMBRE!$L$2:$L$32)","v":0},{"$f":"SUMIF(DICIEMBRE!$A$2:$A$32,Valores!$A47,DICIEMBRE!$H$2:$H$32)+SUMIF(DICIEMBRE!$A$2:$A$32,Valores!$A47,DICIEMBRE!$L$2:$L$32)","v":0},0]
[39,{"$f":"SUMIF(ENERO!$A$2:$A$32,Valores!$A48,ENERO!$H$2:$H$32)+SUMIF(ENERO!$A$2:$A$32,Valores!$A48,ENERO!$L$2:$L$32)","v":0},{"$f":"SUMIF(FEBRERO!$A$2:$A$32,Valores!$A48,FEBRERO!$H$2:$H$29)+SUMIF(FEBRERO!$A$2:$A$32,Valores!$A48,FEBRERO!$L$2:$L$32)","v":0},{"$f":"SUMIF(MARZO!$A$2:$A$32,Valores!$A48,MARZO!$H$2:$H$32)+SUMIF(MARZO!$A$2:$A$32,Valores!$A48,MARZO!$L$2:$L$32)","v":0},{"$f":"SUMIF(ABRIL!$A$2:$A$32,Valores!$A48,ABRIL!$H$2:$H$31)+SUMIF(ABRIL!$A$2:$A$32,Valores!$A48,ABRIL!$L$2:$L$32)","v":0},{"$f":"SUMIF(MAYO!$A$2:$A$32,Valores!$A48,MAYO!$H$2:$H$32)+SUMIF(MAYO!$A$2:$A$32,Valores!$A48,MAYO!$L$2:$L$32)","v":0},{"$f":"SUMIF(JUNIO!$A$2:$A$32,Valores!$A48,JUNIO!$H$2:$H$31)+SUMIF(JUNIO!$A$2:$A$32,Valores!$A48,JUNIO!$L$2:$L$32)","v":0},{"$f":"SUMIF(JULIO!$A$2:$A$32,Valores!$A48,JULIO!$H$2:$H$32)+SUMIF(JULIO!$A$2:$A$32,Valores!$A48,JULIO!$L$2:$L$32)","v":0},{"$f":"SUMIF(AGOSTO!$A$2:$A$32,Valores!$A48,AGOSTO!$H$2:$H$32)+SUMIF(AGOSTO!$A$2:$A$32,Valores!$A48,AGOSTO!$L$2:$L$32)","v":0},{"$f":"SUMIF(SEPTIEMBRE!$A$2:$A$32,Valores!$A48,SEPTIEMBRE!$H$2:$H$31)+SUMIF(SEPTIEMBRE!$A$2:$A$32,Valores!$A48,SEPTIEMBRE!$L$2:$L$32)","v":0},{"$f":"SUMIF(OCTUBRE!$A$2:$A$32,Valores!$A48,OCTUBRE!$H$2:$H$32)+SUMIF(OCTUBRE!$A$2:$A$32,Valores!$A48,OCTUBRE!$L$2:$L$32)","v":0},{"$f":"SUMIF(NOVIEMBRE!$A$2:$A$32,Valores!$A48,NOVIEMBRE!$H$2:$H$31)+SUMIF(NOVIEMBRE!$A$2:$A$32,Valores!$A48,NOVIEMBRE!$L$2:$L$32)","v":0},{"$f":"SUMIF(DICIEMBRE!$A$2:$A$32,Valores!$A48,DICIEMBRE!$H$2:$H$32)+SUMIF(DICIEMBRE!$A$2:$A$32,Valores!$A48,DICIEMBRE!$L$2:$L$32)","v":0},0]
[40,{"$f":"SUMIF(ENERO!$A$2:$A$32,Valores!$A49,ENERO!$H$2:$H$32)+SUMIF(ENERO!$A$2:$A$32,Valores!$A49,ENERO!$L$2:$L$32)","v":0},{"$f":"SUMIF(FEBRERO!$A$2:$A$32,Valores!$A49,FEBRERO!$H$2:$H$29)+SUMIF(FEBRERO!$A$2:$A$32,Valores!$A49,FEBRERO!$L$2:$L$32)","v":0},{"$f":"SUMIF(MARZO!$A$2:$A$32,Valores!$A49,MARZO!$H$2:$H$32)+SUMIF(MARZO!$A$2:$A$32,Valores!$A49,MARZO!$L$2:$L$32)","v":0},{"$f":"SUMIF(ABRIL!$A$2:$A$32,Valores!$A49,ABRIL!$H$2:$H$31)+SUMIF(ABRIL!$A$2:$A$32,Valores!$A49,ABRIL!$L$2:$L$32)","v":0},{"$f":"SUMIF(MAYO!$A$2:$A$32,Valores!$A49,MAYO!$H$2:$H$32)+SUMIF(MAYO!$A$2:$A$32,Valores!$A49,MAYO!$L$2:$L$32)","v":0},{"$f":"SUMIF(JUNIO!$A$2:$A$32,Valores!$A49,JUNIO!$H$2:$H$31)+SUMIF(JUNIO!$A$2:$A$32,Valores!$A49,JUNIO!$L$2:$L$32)","v":0},{"$f":"SUMIF(JULIO!$A$2:$A$32,Valores!$A49,JULIO!$H$2:$H$32)+SUMIF(JULIO!$A$2:$A$32,Valores!$A49,JULIO!$L$2:$L$32)","v":0},{"$f":"SUMIF(AGOSTO!$A$2:$A$32,Valores!$A49,AGOSTO!$H$2:$H$32)+SUMIF(AGOSTO!$A$2:$A$32,Valores!$A49,AGOSTO!$L$2:$L$32)","v":0},{"$f":"SUMIF(SEPTIEMBRE!$A$2:$A$32,Valores!$A49,SEPTIEMBRE!$H$2:$H$31)+SUMIF(SEPTIEMBRE!$A$2:$A$32,Valores!$A49,SEPTIEMBRE!$L$2:$L$32)","v":0},{"$f":"SUMIF(OCTUBRE!$A$2:$A$32,Valores!$A49,OCTUBRE!$H$2:$H$32)+SUMIF(OCTUBRE!$A$2:$A$32,Valores!$A49,OCTUBRE!$L$2:$L$32)","v":0},{"$f":"SUMIF(NOVIEMBRE!$A$2:$A$32,Valores!$A49,NOVIEMBRE!$H$2:$H$31)+SUMIF(NOVIEMBRE!$A$2:$A$32,Valores!$A49,NOVIEMBRE!$L$2:$L$32)","v":0},{"$f":"SUMIF(DICIEMBRE!$A$2:$A$32,Valores!$A49,DICIEMBRE!$H$2:$H$32)+SUMIF(DICIEMBRE!$A$2:$A$32,Valores!$A49,DICIEMBRE!$L$2:$L$32)","v":0},0]
[41,{"$f":"SUMIF(ENERO!$A$2:$A$32,Valores!$A50,ENERO!$H$2:$H$32)+SUMIF(ENERO!$A$2:$A$32,Valores!$A50,ENERO!$L$2:$L$32)","v":0},{"$f":"SUMIF(FEBRERO!$A$2:$A$32,Valores!$A50,FEBRERO!$H$2:$H$29)+SUMIF(FEBRERO!$A$2:$A$32,Valores!$A50,FEBRERO!$L$2:$L$32)","v":0},{"$f":"SUMIF(MARZO!$A$2:$A$32,Valores!$A50,MARZO!$H$2:$H$32)+SUMIF(MARZO!$A$2:$A$32,Valores!$A50,MARZO!$L$2:$L$32)","v":0},{"$f":"SUMIF(ABRIL!$A$2:$A$32,Valores!$A50,ABRIL!$H$2:$H$31)+SUMIF(ABRIL!$A$2:$A$32,Valores!$A50,ABRIL!$L$2:$L$32)","v":0},{"$f":"SUMIF(MAYO!$A$2:$A$32,Valores!$A50,MAYO!$H$2:$H$32)+SUMIF(MAYO!$A$2:$A$32,Valores!$A50,MAYO!$L$2:$L$32)","v":0},{"$f":"SUMIF(JUNIO!$A$2:$A$32,Valores!$A50,JUNIO!$H$2:$H$31)+SUMIF(JUNIO!$A$2:$A$32,Valores!$A50,JUNIO!$L$2:$L$32)","v":0},{"$f":"SUMIF(JULIO!$A$2:$A$32,Valores!$A50,JULIO!$H$2:$H$32)+SUMIF(JULIO!$A$2:$A$32,Valores!$A50,JULIO!$L$2:$L$32)","v":0},{"$f":"SUMIF(AGOSTO!$A$2:$A$32,Valores!$A50,AGOSTO!$H$2:$H$32)+SUMIF(AGOSTO!$A$2:$A$32,Valores!$A50,AGOSTO!$L$2:$L$32)","v":0},{"$f":"SUMIF(SEPTIEMBRE!$A$2:$A$32,Valores!$A50,SEPTIEMBRE!$H$2:$H$31)+SUMIF(SEPTIEMBRE!$A$2:$A$32,Valores!$A50,SEPTIEMBRE!$L$2:$L$32)","v":0},{"$f":"SUMIF(OCTUBRE!$A$2:$A$32,Valores!$A50,OCTUBRE!$H$2:$H$32)+SUMIF(OCTUBRE!$A$2:$A$32,Valores!$A50,OCTUBRE!$L$2:$L$32)","v":0},{"$f":"SUMIF(NOVIEMBRE!$A$2:$A$32,Valores!$A50,NOVIEMBRE!$H$2:$H$31)+SUMIF(NOVIEMBRE!$A$2:$A$32,Valores!$A50,NOVIEMBRE!$L$2:$L$32)","v":0},{"$f":"SUMIF(DICIEMBRE!$A$2:$A$32,Valores!$A50,DICIEMBRE!$H$2:$H$32)+SUMIF(DICIEMBRE!$A$2:$A$32,Valores!$A50,DICIEMBRE!$L$2:$L$32)","v":0},0]
[42,{"$f":"SUMIF(ENERO!$A$2:$A$32,Valores!$A51,ENERO!$H$2:$H$32)+SUMIF(ENERO!$A$2:$A$32,Valores!$A51,ENERO!$L$2:$L$32)","v":0},{"$f":"SUMIF(FEBRERO!$A$2:$A$32,Valores!$A51,FEBRERO!$H$2:$H$29)+SUMIF(FEBRERO!$A$2:$A$32,Valores!$A51,FEBRERO!$L$2:$L$32)","v":0},{"$f":"SUMIF(MARZO!$A$2:$A$32,Valores!$A51,MARZO!$H$2:$H$32)+SUMIF(MARZO!$A$2:$A$32,Valores!$A51,MARZO!$L$2:$L$32)","v":0},{"$f":"SUMIF(ABRIL!$A$2:$A$32,Valores!$A51,ABRIL!$H$2:$H$31)+SUMIF(ABRIL!$A$2:$A$32,Valores!$A51,ABRIL!$L$2:$L$32)","v":0},{"$f":"SUMIF(MAYO!$A$2:$A$32,Valores!$A51,MAYO!$H$2:$H$32)+SUMIF(MAYO!$A$2:$A$32,Valores!$A51,MAYO!$L$2:$L$32)","v":0},{"$f":"SUMIF(JUNIO!$A$2:$A$32,Valores!$A51,JUNIO!$H$2:$H$31)+SUMIF(JUNIO!$A$2:$A$32,Valores!$A51,JUNIO!$L$2:$L$32)","v":0},{"$f":"SUMIF(JULIO!$A$2:$A$32,Valores!$A51,JULIO!$H$2:$H$32)+SUMIF(JULIO!$A$2:$A$32,Valores!$A51,JULIO!$L$2:$L$32)","v":0},{"$f":"SUMIF(AGOSTO!$A$2:$A$32,Valores!$A51,AGOSTO!$H$2:$H$32)+SUMIF(AGOSTO!$A$2:$A$32,Valores!$A51,AGOSTO!$L$2:$L$32)","v":0},{"$f":"SUMIF(SEPTIEMBRE!$A$2:$A$32,Valores!$A51,SEPTIEMBRE!$H$2:$H$31)+SUMIF(SEPTIEMBRE!$A$2:$A$32,Valores!$A51,SEPTIEMBRE!$L$2:$L$32)","v":0},{"$f":"SUMIF(OCTUBRE!$A$2:$A$32,Valores!$A51,OCTUBRE!$H$2:$H$32)+SUMIF(OCTUBRE!$A$2:$A$32,Valores!$A51,OCTUBRE!$L$2:$L$32)","v":0},{"$f":"SUMIF(NOVIEMBRE!$A$2:$A$32,Valores!$A51,NOVIEMBRE!$H$2:$H$31)+SUMIF(NOVIEMBRE!$A$2:$A$32,Valores!$A51,NOVIEMBRE!$L$2:$L$32)","v":0},{"$f":"SUMIF(DICIEMBRE!$A$2:$A$32,Valores!$A51,DICIEMBRE!$H$2:$H$32)+SUMIF(DICIEMBRE!$A$2:$A$32,Valores!$A51,DICIEMBRE!$L$2:$L$32)","v":0},0]
[43,{"$f":"SUMIF(ENERO!$A$2:$A$32,Valores!$A52,ENERO!$H$2:$H$32)+SUMIF(ENERO!$A$2:$A$32,Valores!$A52,ENERO!$L$2:$L$32)","v":0},{"$f":"SUMIF(FEBRERO!$A$2:$A$32,Valores!$A52,FEBRERO!$H$2:$H$29)+SUMIF(FEBRERO!$A$2:$A$32,Valores!$A52,FEBRERO!$L$2:$L$32)","v":0},{"$f":"SUMIF(MARZO!$A$2:$A$32,Valores!$A52,MARZO!$H$2:$H$32)+SUMIF(MARZO!$A$2:$A$32,Valores!$A52,MARZO!$L$2:$L$32)","v":0},{"$f":"SUMIF(ABRIL!$A$2:$A$32,Valores!$A52,ABRIL!$H$2:$H$31)+SUMIF(ABRIL!$A$2:$A$32,Valores!$A52,ABRIL!$L$2:$L$32)","v":0},{"$f":"SUMIF(MAYO!$A$2:$A$32,Valores!$A52,MAYO!$H$2:$H$32)+SUMIF(MAYO!$A$2:$A$32,Valores!$A52,MAYO!$L$2:$L$32)","v":0},{"$f":"SUMIF(JUNIO!$A$2:$A$32,Valores!$A52,JUNIO!$H$2:$H$31)+SUMIF(JUNIO!$A$2:$A$32,Valores!$A52,JUNIO!$L$2:$L$32)","v":0},{"$f":"SUMIF(JULIO!$A$2:$A$32,Valores!$A52,JULIO!$H$2:$H$32)+SUMIF(JULIO!$A$2:$A$32,Valores!$A52,JULIO!$L$2:$L$32)","v":0},{"$f":"SUMIF(AGOSTO!$A$2:$A$32,Valores!$A52,AGOSTO!$H$2:$H$32)+SUMIF(AGOSTO!$A$2:$A$32,Valores!$A52,AGOSTO!$L$2:$L$32)","v":0},{"$f":"SUMIF(SEPTIEMBRE!$A$2:$A$32,Valores!$A52,SEPTIEMBRE!$H$2:$H$31)+SUMIF(SEPTIEMBRE!$A$2:$A$32,Valores!$A52,SEPTIEMBRE!$L$2:$L$32)","v":0},{"$f":"SUMIF(OCTUBRE!$A$2:$A$32,Valores!$A52,OCTUBRE!$H$2:$H$32)+SUMIF(OCTUBRE!$A$2:$A$32,Valores!$A52,OCTUBRE!$L$2:$L$32)","v":0},{"$f":"SUMIF(NOVIEMBRE!$A$2:$A$32,Valores!$A52,NOVIEMBRE!$H$2:$H$31)+SUMIF(NOVIEMBRE!$A$2:$A$32,Valores!$A52,NOVIEMBRE!$L$2:$L$32)","v":0},{"$f":"SUMIF(DICIEMBRE!$A$2:$A$32,Valores!$A52,DICIEMBRE!$H$2:$H$32)+SUMIF(DICIEMBRE!$A$2:$A$32,Valores!$A52,DICIEMBRE!$L$2:$L$32)","v":0},0]
[44,{"$f":"SUMIF(ENERO!$A$2:$A$32,Valores!$A53,ENERO!$H$2:$H$32)+SUMIF(ENERO!$A$2:$A$32,Valores!$A53,ENERO!$L$2:$L$32)","v":0},{"$f":"SUMIF(FEBRERO!$A$2:$A$32,Valores!$A53,FEBRERO!$H$2:$H$29)+SUMIF(FEBRERO!$A$2:$A$32,Valores!$A53,FEBRERO!$L$2:$L$32)","v":0},{"$f":"SUMIF(MARZO!$A$2:$A$32,Valores!$A53,MARZO!$H$2:$H$32)+SUMIF(MARZO!$A$2:$A$32,Valores!$A53,MARZO!$L$2:$L$32)","v":0},{"$f":"SUMIF(ABRIL!$A$2:$A$32,Valores!$A53,ABRIL!$H$2:$H$31)+SUMIF(ABRIL!$A$2:$A$32,Valores!$A53,ABRIL!$L$2:$L$32)","v":0},{"$f":"SUMIF(MAYO!$A$2:$A$32,Valores!$A53,MAYO!$H$2:$H$32)+SUMIF(MAYO!$A$2:$A$32,Valores!$A53,MAYO!$L$2:$L$32)","v":0},{"$f":"SUMIF(JUNIO!$A$2:$A$32,Valores!$A53,JUNIO!$H$2:$H$31)+SUMIF(JUNIO!$A$2:$A$32,Valores!$A53,JUNIO!$L$2:$L$32)","v":0},{"$f":"SUMIF(JULIO!$A$2:$A$32,Valores!$A53,JULIO!$H$2:$H$32)+SUMIF(JULIO!$A$2:$A$32,Valores!$A53,JULIO!$L$2:$L$32)","v":0},{"$f":"SUMIF(AGOSTO!$A$2:$A$32,Valores!$A53,AGOSTO!$H$2:$H$32)+SUMIF(AGOSTO!$A$2:$A$32,Valores!$A53,AGOSTO!$L$2:$L$32)","v":0},{"$f":"SUMIF(SEPTIEMBRE!$A$2:$A$32,Valores!$A53,SEPTIEMBRE!$H$2:$H$31)+SUMIF(SEPTIEMBRE!$A$2:$A$32,Valores!$A53,SEPTIEMBRE!$L$2:$L$32)","v":0},{"$f":"SUMIF(OCTUBRE!$A$2:$A$32,Valores!$A53,OCTUBRE!$H$2:$H$32)+SUMIF(OCTUBRE!$A$2:$A$32,Valores!$A53,OCTUBRE!$L$2:$L$32)","v":0},{"$f":"SUMIF(NOVIEMBRE!$A$2:$A$32,Valores!$A53,NOVIEMBRE!$H$2:$H$31)+SUMIF(NOVIEMBRE!$A$2:$A$32,Valores!$A53,NOVIEMBRE!$L$2:$L$32)","v":0},{"$f":"SUMIF(DICIEMBRE!$A$2:$A$32,Valores!$A53,DICIEMBRE!$H$2:$H$32)+SUMIF(DICIEMBRE!$A$2:$A$32,Valores!$A53,DICIEMBRE!$L$2:$L$32)","v":0},0]
[45,{"$f":"SUMIF(ENERO!$A$2:$A$32,Valores!$A54,ENERO!$H$2:$H$32)+SUMIF(ENERO!$A$2:$A$32,Valores!$A54,ENERO!$L$2:$L$32)","v":0},{"$f":"SUMIF(FEBRERO!$A$2:$A$32,Valores!$A54,FEBRERO!$H$2:$H$29)+SUMIF(FEBRERO!$A$2:$A$32,Valores!$A54,FEBRERO!$L$2:$L$32)","v":0},{"$f":"SUMIF(MARZO!$A$2:$A$32,Valores!$A54,MARZO!$H$2:$H$32)+SUMIF(MARZO!$A$2:$A$32,Valores!$A54,MARZO!$L$2:$L$32)","v":0},{"$f":"SUMIF(ABRIL!$A$2:$A$32,Valores!$A54,ABRIL!$H$2:$H$31)+SUMIF(ABRIL!$A$2:$A$32,Valores!$A54,ABRIL!$L$2:$L$32)","v":0},{"$f":"SUMIF(MAYO!$A$2:$A$32,Valores!$A54,MAYO!$H$2:$H$32)+SUMIF(MAYO!$A$2:$A$32,Valores!$A54,MAYO!$L$2:$L$32)","v":0},{"$f":"SUMIF(JUNIO!$A$2:$A$32,Valores!$A54,JUNIO!$H$2:$H$31)+SUMIF(JUNIO!$A$2:$A$32,Valores!$A54,JUNIO!$L$2:$L$32)","v":0},{"$f":"SUMIF(JULIO!$A$2:$A$32,Valores!$A54,JULIO!$H$2:$H$32)+SUMIF(JULIO!$A$2:$A$32,Valores!$A54,JULIO!$L$2:$L$32)","v":0},{"$f":"SUMIF(AGOSTO!$A$2:$A$32,Valores!$A54,AGOSTO!$H$2:$H$32)+SUMIF(AGOSTO!$A$2:$A$32,Valores!$A54,AGOSTO!$L$2:$L$32)","v":0},{"$f":"SUMIF(SEPTIEMBRE!$A$2:$A$32,Valores!$A54,SEPTIEMBRE!$H$2:$H$31)+SUMIF(SEPTIEMBRE!$A$2:$A$32,Valores!$A54,SEPTIEMBRE!$L$2:$L$32)","v":0},{"$f":"SUMIF(OCTUBRE!$A$2:$A$32,Valores!$A54,OCTUBRE!$H$2:$H$32)+SUMIF(OCTUBRE!$A$2:$A$32,Valores!$A54,OCTUBRE!$L$2:$L$32)","v":0},{"$f":"SUMIF(NOVIEMBRE!$A$2:$A$32,Valores!$A54,NOVIEMBRE!$H$2:$H$31)+SUMIF(NOVIEMBRE!$A$2:$A$32,Valores!$A54,NOVIEMBRE!$L$2:$L$32)","v":0},{"$f":"SUMIF(DICIEMBRE!$A$2:$A$32,Valores!$A54,DICIEMBRE!$H$2:$H$32)+SUMIF(DICIEMBRE!$A$2:$A$32,Valores!$A54,DICIEMBRE!$L$2:$L$32)","v":0},0]
[46,{"$f":"SUMIF(ENERO!$A$2:$A$32,Valores!$A55,ENERO!$H$2:$H$32)+SUMIF(ENERO!$A$2:$A$32,Valores!$A55,ENERO!$L$2:$L$32)","v":0},{"$f":"SUMIF(FEBRERO!$A$2:$A$32,Valores!$A55,FEBRERO!$H$2:$H$29)+SUMIF(FEBRERO!$A$2:$A$32,Valores!$A55,FEBRERO!$L$2:$L$32)","v":0},{"$f":"SUMIF(MARZO!$A$2:$A$32,Valores!$A55,MARZO!$H$2:$H$32)+SUMIF(MARZO!$A$2:$A$32,Valores!$A55,MARZO!$L$2:$L$32)","v":0},{"$f":"SUMIF(ABRIL!$A$2:$A$32,Valores!$A55,ABRIL!$H$2:$H$31)+SUMIF(ABRIL!$A$2:$A$32,Valores!$A55,ABRIL!$L$2:$L$32)","v":0},{"$f":"SUMIF(MAYO!$A$2:$A$32,Valores!$A55,MAYO!$H$2:$H$32)+SUMIF(MAYO!$A$2:$A$32,Valores!$A55,MAYO!$L$2:$L$32)","v":0},{"$f":"SUMIF(JUNIO!$A$2:$A$32,Valores!$A55,JUNIO!$H$2:$H$31)+SUMIF(JUNIO!$A$2:$A$32,Valores!$A55,JUNIO!$L$2:$L$32)","v":0},{"$f":"SUMIF(JULIO!$A$2:$A$32,Valores!$A55,JULIO!$H$2:$H$32)+SUMIF(JULIO!$A$2:$A$32,Valores!$A55,JULIO!$L$2:$L$32)","v":0},{"$f":"SUMIF(AGOSTO!$A$2:$A$32,Valores!$A55,AGOSTO!$H$2:$H$32)+SUMIF(AGOSTO!$A$2:$A$32,Valores!$A55,AGOSTO!$L$2:$L$32)","v":0},{"$f":"SUMIF(SEPTIEMBRE!$A$2:$A$32,Valores!$A55,SEPTIEMBRE!$H$2:$H$31)+SUMIF(SEPTIEMBRE!$A$2:$A$32,Valores!$A55,SEPTIEMBRE!$L$2:$L$32)","v":0},{"$f":"SUMIF(OCTUBRE!$A$2:$A$32,Valores!$A55,OCTUBRE!$H$2:$H$32)+SUMIF(OCTUBRE!$A$2:$A$32,Valores!$A55,OCTUBRE!$L$2:$L$32)","v":0},{"$f":"SUMIF(NOVIEMBRE!$A$2:$A$32,Valores!$A55,NOVIEMBRE!$H$2:$H$31)+SUMIF(NOVIEMBRE!$A$2:$A$32,Valores!$A55,NOVIEMBRE!$L$2:$L$32)","v":0},{"$f":"SUMIF(DICIEMBRE!$A$2:$A$32,Valores!$A55,DICIEMBRE!$H$2:$H$32)+SUMIF(DICIEMBRE!$A$2:$A$32,Valores!$A55,DICIEMBRE!$L$2:$L$32)","v":0},0]
[47,{"$f":"SUMIF(ENERO!$A$2:$A$32,Valores!$A56,ENERO!$H$2:$H$32)+SUMIF(ENERO!$A$2:$A$32,Valores!$A56,ENERO!$L$2:$L$32)","v":0},{"$f":"SUMIF(FEBRERO!$A$2:$A$32,Valores!$A56,FEBRERO!$H$2:$H$29)+SUMIF(FEBRERO!$A$2:$A$32,Valores!$A56,FEBRERO!$L$2:$L$32)","v":0},{"$f":"SUMIF(MARZO!$A$2:$A$32,Valores!$A56,MARZO!$H$2:$H$32)+SUMIF(MARZO!$A$2:$A$32,Valores!$A56,MARZO!$L$2:$L$32)","v":0},{"$f":"SUMIF(ABRIL!$A$2:$A$32,Valores!$A56,ABRIL!$H$2:$H$31)+SUMIF(ABRIL!$A$2:$A$32,Valores!$A56,ABRIL!$L$2:$L$32)","v":0},{"$f":"SUMIF(MAYO!$A$2:$A$32,Valores!$A56,MAYO!$H$2:$H$32)+SUMIF(MAYO!$A$2:$A$32,Valores!$A56,MAYO!$L$2:$L$32)","v":0},{"$f":"SUMIF(JUNIO!$A$2:$A$32,Valores!$A56,JUNIO!$H$2:$H$31)+SUMIF(JUNIO!$A$2:$A$32,Valores!$A56,JUNIO!$L$2:$L$32)","v":0},{"$f":"SUMIF(JULIO!$A$2:$A$32,Valores!$A56,JULIO!$H$2:$H$32)+SUMIF(JULIO!$A$2:$A$32,Valores!$A56,JULIO!$L$2:$L$32)","v":0},{"$f":"SUMIF(AGOSTO!$A$2:$A$32,Valores!$A56,AGOSTO!$H$2:$H$32)+SUMIF(AGOSTO!$A$2:$A$32,Valores!$A56,AGOSTO!$L$2:$L$32)","v":0},{"$f":"SUMIF(SEPTIEMBRE!$A$2:$A$32,Valores!$A56,SEPTIEMBRE!$H$2:$H$31)+SUMIF(SEPTIEMBRE!$A$2:$A$32,Valores!$A56,SEPTIEMBRE!$L$2:$L$32)","v":0},{"$f":"SUMIF(OCTUBRE!$A$2:$A$32,Valores!$A56,OCTUBRE!$H$2:$H$32)+SUMIF(OCTUBRE!$A$2:$A$32,Valores!$A56,OCTUBRE!$L$2:$L$32)","v":0},{"$f":"SUMIF(NOVIEMBRE!$A$2:$A$32,Valores!$A56,NOVIEMBRE!$H$2:$H$31)+SUMIF(NOVIEMBRE!$A$2:$A$32,Valores!$A56,NOVIEMBRE!$L$2:$L$32)","v":0},{"$f":"SUMIF(DICIEMBRE!$A$2:$A$32,Valores!$A56,DICIEMBRE!$H$2:$H$32)+SUMIF(DICIEMBRE!$A$2:$A$32,Valores!$A56,DICIEMBRE!$L$2:$L$32)","v":0},0]
[48,{"$f":"SUMIF(ENERO!$A$2:$A$32,Valores!$A57,ENERO!$H$2:$H$32)+SUMIF(ENERO!$A$2:$A$32,Valores!$A57,ENERO!$L$2:$L$32)","v":0},{"$f":"SUMIF(FEBRERO!$A$2:$A$32,Valores!$A57,FEBRERO!$H$2:$H$29)+SUMIF(FEBRERO!$A$2:$A$32,Valores!$A57,FEBRERO!$L$2:$L$32)","v":0},{"$f":"SUMIF(MARZO!$A$2:$A$32,Valores!$A57,MARZO!$H$2:$H$32)+SUMIF(MARZO!$A$2:$A$32,Valores!$A57,MARZO!$L$2:$L$32)","v":0},{"$f":"SUMIF(ABRIL!$A$2:$A$32,Valores!$A57,ABRIL!$H$2:$H$31)+SUMIF(ABRIL!$A$2:$A$32,Valores!$A57,ABRIL!$L$2:$L$32)","v":0},{"$f":"SUMIF(MAYO!$A$2:$A$32,Valores!$A57,MAYO!$H$2:$H$32)+SUMIF(MAYO!$A$2:$A$32,Valores!$A57,MAYO!$L$2:$L$32)","v":0},{"$f":"SUMIF(JUNIO!$A$2:$A$32,Valores!$A57,JUNIO!$H$2:$H$31)+SUMIF(JUNIO!$A$2:$A$32,Valores!$A57,JUNIO!$L$2:$L$32)","v":0},{"$f":"SUMIF(JULIO!$A$2:$A$32,Valores!$A57,JULIO!$H$2:$H$32)+SUMIF(JULIO!$A$2:$A$32,Valores!$A57,JULIO!$L$2:$L$32)","v":0},{"$f":"SUMIF(AGOSTO!$A$2:$A$32,Valores!$A57,AGOSTO!$H$2:$H$32)+SUMIF(AGOSTO!$A$2:$A$32,Valores!$A57,AGOSTO!$L$2:$L$32)","v":0},{"$f":"SUMIF(SEPTIEMBRE!$A$2:$A$32,Valores!$A57,SEPTIEMBRE!$H$2:$H$31)+SUMIF(SEPTIEMBRE!$A$2:$A$32,Valores!$A57,SEPTIEMBRE!$L$2:$L$32)","v":0},{"$f":"SUMIF(OCTUBRE!$A$2:$A$32,Valores!$A57,OCTUBRE!$H$2:$H$32)+SUMIF(OCTUBRE!$A$2:$A$32,Valores!$A57,OCTUBRE!$L$2:$L$32)","v":0},{"$f":"SUMIF(NOVIEMBRE!$A$2:$A$32,Valores!$A57,NOVIEMBRE!$H$2:$H$31)+SUMIF(NOVIEMBRE!$A$2:$A$32,Valores!$A57,NOVIEMBRE!$L$2:$L$32)","v":0},{"$f":"SUMIF(DICIEMBRE!$A$2:$A$32,Valores!$A57,DICIEMBRE!$H$2:$H$32)+SUMIF(DICIEMBRE!$A$2:$A$32,Valores!$A57,DICIEMBRE!$L$2:$L$32)","v":0},0]
[49,{"$f":"SUMIF(ENERO!$A$2:$A$32,Valores!$A58,ENERO!$H$2:$H$32)+SUMIF(ENERO!$A$2:$A$32,Valores!$A58,ENERO!$L$2:$L$32)","v":0},{"$f":"SUMIF(FEBRERO!$A$2:$A$32,Valores!$A58,FEBRERO!$H$2:$H$29)+SUMIF(FEBRERO!$A$2:$A$32,Valores!$A58,FEBRERO!$L$2:$L$32)","v":0},{"$f":"SUMIF(MARZO!$A$2:$A$32,Valores!$A58,MARZO!$H$2:$H$32)+SUMIF(MARZO!$A$2:$A$32,Valores!$A58,MARZO!$L$2:$L$32)","v":0},{"$f":"SUMIF(ABRIL!$A$2:$A$32,Valores!$A58,ABRIL!$H$2:$H$31)+SUMIF(ABRIL!$A$2:$A$32,Valores!$A58,ABRIL!$L$2:$L$32)","v":0},{"$f":"SUMIF(MAYO!$A$2:$A$32,Valores!$A58,MAYO!$H$2:$H$32)+SUMIF(MAYO!$A$2:$A$32,Valores!$A58,MAYO!$L$2:$L$32)","v":0},{"$f":"SUMIF(JUNIO!$A$2:$A$32,Valores!$A58,JUNIO!$H$2:$H$31)+SUMIF(JUNIO!$A$2:$A$32,Valores!$A58,JUNIO!$L$2:$L$32)","v":0},{"$f":"SUMIF(JULIO!$A$2:$A$32,Valores!$A58,JULIO!$H$2:$H$32)+SUMIF(JULIO!$A$2:$A$32,Valores!$A58,JULIO!$L$2:$L$32)","v":0},{"$f":"SUMIF(AGOSTO!$A$2:$A$32,Valores!$A58,AGOSTO!$H$2:$H$32)+SUMIF(AGOSTO!$A$2:$A$32,Valores!$A58,AGOSTO!$L$2:$L$32)","v":0},{"$f":"SUMIF(SEPTIEMBRE!$A$2:$A$32,Valores!$A58,SEPTIEMBRE!$H$2:$H$31)+SUMIF(SEPTIEMBRE!$A$2:$A$32,Valores!$A58,SEPTIEMBRE!$L$2:$L$32)","v":0},{"$f":"SUMIF(OCTUBRE!$A$2:$A$32,Valores!$A58,OCTUBRE!$H$2:$H$32)+SUMIF(OCTUBRE!$A$2:$A$32,Valores!$A58,OCTUBRE!$L$2:$L$32)","v":0},{"$f":"SUMIF(NOVIEMBRE!$A$2:$A$32,Valores!$A58,NOVIEMBRE!$H$2:$H$31)+SUMIF(NOVIEMBRE!$A$2:$A$32,Valores!$A58,NOVIEMBRE!$L$2:$L$32)","v":0},{"$f":"SUMIF(DICIEMBRE!$A$2:$A$32,Valores!$A58,DICIEMBRE!$H$2:$H$32)+SUMIF(DICIEMBRE!$A$2:$A$32,Valores!$A58,DICIEMBRE!$L$2:$L$32)","v":0},0]
[50,{"$f":"SUMIF(ENERO!$A$2:$A$32,Valores!$A59,ENERO!$H$2:$H$32)+SUMIF(ENERO!$A$2:$A$32,Valores!$A59,ENERO!$L$2:$L$32)","v":0},{"$f":"SUMIF(FEBRERO!$A$2:$A$32,Valores!$A59,FEBRERO!$H$2:$H$29)+SUMIF(FEBRERO!$A$2:$A$32,Valores!$A59,FEBRERO!$L$2:$L$32)","v":0},{"$f":"SUMIF(MARZO!$A$2:$A$32,Valores!$A59,MARZO!$H$2:$H$32)+SUMIF(MARZO!$A$2:$A$32,Valores!$A59,MARZO!$L$2:$L$32)","v":0},{"$f":"SUMIF(ABRIL!$A$2:$A$32,Valores!$A59,ABRIL!$H$2:$H$31)+SUMIF(ABRIL!$A$2:$A$32,Valores!$A59,ABRIL!$L$2:$L$32)","v":0},{"$f":"SUMIF(MAYO!$A$2:$A$32,Valores!$A59,MAYO!$H$2:$H$32)+SUMIF(MAYO!$A$2:$A$32,Valores!$A59,MAYO!$L$2:$L$32)","v":0},{"$f":"SUMIF(JUNIO!$A$2:$A$32,Valores!$A59,JUNIO!$H$2:$H$31)+SUMIF(JUNIO!$A$2:$A$32,Valores!$A59,JUNIO!$L$2:$L$32)","v":0},{"$f":"SUMIF(JULIO!$A$2:$A$32,Valores!$A59,JULIO!$H$2:$H$32)+SUMIF(JULIO!$A$2:$A$32,Valores!$A59,JULIO!$L$2:$L$32)","v":0},{"$f":"SUMIF(AGOSTO!$A$2:$A$32,Valores!$A59,AGOSTO!$H$2:$H$32)+SUMIF(AGOSTO!$A$2:$A$32,Valores!$A59,AGOSTO!$L$2:$L$32)","v":0},{"$f":"SUMIF(SEPTIEMBRE!$A$2:$A$32,Valores!$A59,SEPTIEMBRE!$H$2:$H$31)+SUMIF(SEPTIEMBRE!$A$2:$A$32,Valores!$A59,SEPTIEMBRE!$L$2:$L$32)","v":0},{"$f":"SUMIF(OCTUBRE!$A$2:$A$32,Valores!$A59,OCTUBRE!$H$2:$H$32)+SUMIF(OCTUBRE!$A$2:$A$32,Valores!$A59,OCTUBRE!$L$2:$L$32)","v":0},{"$f":"SUMIF(NOVIEMBRE!$A$2:$A$32,Valores!$A59,NOVIEMBRE!$H$2:$H$31)+SUMIF(NOVIEMBRE!$A$2:$A$32,Valores!$A59,NOVIEMBRE!$L$2:$L$32)","v":0},{"$f":"SUMIF(DICIEMBRE!$A$2:$A$32,Valores!$A59,DICIEMBRE!$H$2:$H$32)+SUMIF(DICIEMBRE!$A$2:$A$32,Valores!$A59,DICIEMBRE!$L$2:$L$32)","v":0},0]
[51,{"$f":"SUMIF(ENERO!$A$2:$A$32,Valores!$A60,ENERO!$H$2:$H$32)+SUMIF(ENERO!$A$2:$A$32,Valores!$A60,ENERO!$L$2:$L$32)","v":0},{"$f":"SUMIF(FEBRERO!$A$2:$A$32,Valores!$A60,FEBRERO!$H$2:$H$29)+SUMIF(FEBRERO!$A$2:$A$32,Valores!$A60,FEBRERO!$L$2:$L$32)","v":0},{"$f":"SUMIF(MARZO!$A$2:$A$32,Valores!$A60,MARZO!$H$2:$H$32)+SUMIF(MARZO!$A$2:$A$32,Valores!$A60,MARZO!$L$2:$L$32)","v":0},{"$f":"SUMIF(ABRIL!$A$2:$A$32,Valores!$A60,ABRIL!$H$2:$H$31)+SUMIF(ABRIL!$A$2:$A$32,Valores!$A60,ABRIL!$L$2:$L$32)","v":0},{"$f":"SUMIF(MAYO!$A$2:$A$32,Valores!$A60,MAYO!$H$2:$H$32)+SUMIF(MAYO!$A$2:$A$32,Valores!$A60,MAYO!$L$2:$L$32)","v":0},{"$f":"SUMIF(JUNIO!$A$2:$A$32,Valores!$A60,JUNIO!$H$2:$H$31)+SUMIF(JUNIO!$A$2:$A$32,Valores!$A60,JUNIO!$L$2:$L$32)","v":0},{"$f":"SUMIF(JULIO!$A$2:$A$32,Valores!$A60,JULIO!$H$2:$H$32)+SUMIF(JULIO!$A$2:$A$32,Valores!$A60,JULIO!$L$2:$L$32)","v":0},{"$f":"SUMIF(AGOSTO!$A$2:$A$32,Valores!$A60,AGOSTO!$H$2:$H$32)+SUMIF(AGOSTO!$A$2:$A$32,Valores!$A60,AGOSTO!$L$2:$L$32)","v":0},{"$f":"SUMIF(SEPTIEMBRE!$A$2:$A$32,Valores!$A60,SEPTIEMBRE!$H$2:$H$31)+SUMIF(SEPTIEMBRE!$A$2:$A$32,Valores!$A60,SEPTIEMBRE!$L$2:$L$32)","v":0},{"$f":"SUMIF(OCTUBRE!$A$2:$A$32,Valores!$A60,OCTUBRE!$H$2:$H$32)+SUMIF(OCTUBRE!$A$2:$A$32,Valores!$A60,OCTUBRE!$L$2:$L$32)","v":0},{"$f":"SUMIF(NOVIEMBRE!$A$2:$A$32,Valores!$A60,NOVIEMBRE!$H$2:$H$31)+SUMIF(NOVIEMBRE!$A$2:$A$32,Valores!$A60,NOVIEMBRE!$L$2:$L$32)","v":0},{"$f":"SUMIF(DICIEMBRE!$A$2:$A$32,Valores!$A60,DICIEMBRE!$H$2:$H$32)+SUMIF(DICIEMBRE!$A$2:$A$32,Valores!$A60,DICIEMBRE!$L$2:$L$32)","v":0},0]
[52,{"$f":"SUMIF(ENERO!$A$2:$A$32,Valores!$A61,ENERO!$H$2:$H$32)+SUMIF(ENERO!$A$2:$A$32,Valores!$A61,ENERO!$L$2:$L$32)","v":0},{"$f":"SUMIF(FEBRERO!$A$2:$A$32,Valores!$A61,FEBRERO!$H$2:$H$29)+SUMIF(FEBRERO!$A$2:$A$32,Valores!$A61,FEBRERO!$L$2:$L$32)","v":0},{"$f":"SUMIF(MARZO!$A$2:$A$32,Valores!$A61,MARZO!$H$2:$H$32)+SUMIF(MARZO!$A$2:$A$32,Valores!$A61,MARZO!$L$2:$L$32)","v":0},{"$f":"SUMIF(ABRIL!$A$2:$A$32,Valores!$A61,ABRIL!$H$2:$H$31)+SUMIF(ABRIL!$A$2:$A$32,Valores!$A61,ABRIL!$L$2:$L$32)","v":0},{"$f":"SUMIF(MAYO!$A$2:$A$32,Valores!$A61,MAYO!$H$2:$H$32)+SUMIF(MAYO!$A$2:$A$32,Valores!$A61,MAYO!$L$2:$L$32)","v":0},{"$f":"SUMIF(JUNIO!$A$2:$A$32,Valores!$A61,JUNIO!$H$2:$H$31)+SUMIF(JUNIO!$A$2:$A$32,Valores!$A61,JUNIO!$L$2:$L$32)","v":0},{"$f":"SUMIF(JULIO!$A$2:$A$32,Valores!$A61,JULIO!$H$2:$H$32)+SUMIF(JULIO!$A$2:$A$32,Valores!$A61,JULIO!$L$2:$L$32)","v":0},{"$f":"SUMIF(AGOSTO!$A$2:$A$32,Valores!$A61,AGOSTO!$H$2:$H$32)+SUMIF(AGOSTO!$A$2:$A$32,Valores!$A61,AGOSTO!$L$2:$L$32)","v":0},{"$f":"SUMIF(SEPTIEMBRE!$A$2:$A$32,Valores!$A61,SEPTIEMBRE!$H$2:$H$31)+SUMIF(SEPTIEMBRE!$A$2:$A$32,Valores!$A61,SEPTIEMBRE!$L$2:$L$32)","v":0},{"$f":"SUMIF(OCTUBRE!$A$2:$A$32,Valores!$A61,OCTUBRE!$H$2:$H$32)+SUMIF(OCTUBRE!$A$2:$A$32,Valores!$A61,OCTUBRE!$L$2:$L$32)","v":0},{"$f":"SUMIF(NOVIEMBRE!$A$2:$A$32,Valores!$A61,NOVIEMBRE!$H$2:$H$31)+SUMIF(NOVIEMBRE!$A$2:$A$32,Valores!$A61,NOVIEMBRE!$L$2:$L$32)","v":0},{"$f":"SUMIF(DICIEMBRE!$A$2:$A$32,Valores!$A61,DICIEMBRE!$H$2:$H$32)+SUMIF(DICIEMBRE!$A$2:$A$32,Valores!$A61,DICIEMBRE!$L$2:$L$32)","v":0},0]
[53,{"$f":"SUMIF(ENERO!$A$2:$A$32,Valores!$A62,ENERO!$H$2:$H$32)+SUMIF(ENERO!$A$2:$A$32,Valores!$A62,ENERO!$L$2:$L$32)","v":0},{"$f":"SUMIF(FEBRERO!$A$2:$A$32,Valores!$A62,FEBRERO!$H$2:$H$29)+SUMIF(FEBRERO!$A$2:$A$32,Valores!$A62,FEBRERO!$L$2:$L$32)","v":0},{"$f":"SUMIF(MARZO!$A$2:$A$32,Valores!$A62,MARZO!$H$2:$H$32)+SUMIF(MARZO!$A$2:$A$32,Valores!$A62,MARZO!$L$2:$L$32)","v":0},{"$f":"SUMIF(ABRIL!$A$2:$A$32,Valores!$A62,ABRIL!$H$2:$H$31)+SUMIF(ABRIL!$A$2:$A$32,Valores!$A62,ABRIL!$L$2:$L$32)","v":0},{"$f":"SUMIF(MAYO!$A$2:$A$32,Valores!$A62,MAYO!$H$2:$H$32)+SUMIF(MAYO!$A$2:$A$32,Valores!$A62,MAYO!$L$2:$L$32)","v":0},{"$f":"SUMIF(JUNIO!$A$2:$A$32,Valores!$A62,JUNIO!$H$2:$H$31)+SUMIF(JUNIO!$A$2:$A$32,Valores!$A62,JUNIO!$L$2:$L$32)","v":0},{"$f":"SUMIF(JULIO!$A$2:$A$32,Valores!$A62,JULIO!$H$2:$H$32)+SUMIF(JULIO!$A$2:$A$32,Valores!$A62,JULIO!$L$2:$L$32)","v":0},{"$f":"SUMIF(AGOSTO!$A$2:$A$32,Valores!$A62,AGOSTO!$H$2:$H$32)+SUMIF(AGOSTO!$A$2:$A$32,Valores!$A62,AGOSTO!$L$2:$L$32)","v":0},{"$f":"SUMIF(SEPTIEMBRE!$A$2:$A$32,Valores!$A62,SEPTIEMBRE!$H$2:$H$31)+SUMIF(SEPTIEMBRE!$A$2:$A$32,Valores!$A62,SEPTIEMBRE!$L$2:$L$32)","v":0},{"$f":"SUMIF(OCTUBRE!$A$2:$A$32,Valores!$A62,OCTUBRE!$H$2:$H$32)+SUMIF(OCTUBRE!$A$2:$A$32,Valores!$A62,OCTUBRE!$L$2:$L$32)","v":0},{"$f":"SUMIF(NOVIEMBRE!$A$2:$A$32,Valores!$A62,NOVIEMBRE!$H$2:$H$31)+SUMIF(NOVIEMBRE!$A$2:$A$32,Valores!$A62,NOVIEMBRE!$L$2:$L$32)","v":0},{"$f":"SUMIF(DICIEMBRE!$A$2:$A$32,Valores!$A62,DICIEMBRE!$H$2:$H$32)+SUMIF(DICIEMBRE!$A$2:$A$32,Valores!$A62,DICIEMBRE!$L$2:$L$32)","v":0},0]

{"sheet":"Calendario","index":2,"n_rows":365,"n_cols":30,"rows_kept":365,"cut":false,"hidden":false,"merged":[[18,4,18,10],[18,13,18,19],[18,22,18,28],[26,4,26,10],[26,13,26,19],[26,22,26,28],[2,4,2,10],[2,13,2,19],[2,22,2,28],[10,4,10,10],[10,13,10,19],[10,22,10,28],[0,27,0,29],[0,4,0,8],[0,10,0,13],[0,15,0,17],[0,19,0,21],[0,23,0,25]]}
["2019-01-01",1,{"$f":"VLOOKUP(A1,ENERO!B2:D32,3,FALSE)","v":"Festivo"},null,"Fin de semana o Festivo",null,null,null,null,null,"IT o Permiso reglam.",null,null,null,null,"Vacaciones",null,null,null,"Día CON tarde",null,null,null,"Día SIN Tarde",null,null,null,"Semana actual"]
["2019-01-02",2,{"$f":"VLOOKUP(A2,ENERO!B3:D33,3,FALSE)","v":""}]
["2019-01-03",3,{"$f":"VLOOKUP(A3,ENERO!B4:D34,3,FALSE)","v":""},null,"ENERO(T: 0 H: 0,00)",null,null,null,null,null,null,null,null,"FEBRERO(T: 0 H: 0,00)",null,null,null,null,null,null,null,null,"MARZO(T: 0 H: 0,00)"]
["2019-01-04",4,{"$f":"VLOOKUP(A4,ENERO!B5:D35,3,FALSE)","v":""},null,"L","M","X","J","V","S","D","HTS",null,"L","M","X","J","V","S","D","HTS",null,"L","M","X","J","V","S","D","HTS"]
["2019-01-05",5,{"$f":"VLOOKUP(A5,ENERO!B6:D36,3,FALSE)","v":"Fin de semana"},1,null,1,2,3,4,5,6,{"$f":"VLOOKUP(Calendario!D5,Resumen!$Q$15:$R$67,2,FALSE)","v":"00,00"},5,null,null,null,null,1,2,3,{"$f":"VLOOKUP(Calendario!M5,Resumen!$Q$15:$R$67,2,FALSE)","v":"00,00"},9,null,null,null,null,1,2,3,{"$f":"VLOOKUP(Calendario!V5,Resumen!$Q$15:$R$67,2,FALSE)","v":"00,00"}]
["2019-01-06",6,{"$f":"VLOOKUP(A6,ENERO!B7:D37,3,FALSE)","v":"Fin de semana"},2,7,8,9,10,11,12,13,{"$f":"VLOOKUP(Calendario!D6,Resumen!$Q$15:$R$67,2,FALSE)","v":"00,00"},6,4,5,6,7,8,9,10,{"$f":"VLOOKUP(Calendario!M6,Resumen!$Q$15:$R$67,2,FALSE)","v":"00,00"},10,4,5,6,7,8,9,10,{"$f":"VLOOKUP(Calendario!V6,Resumen!$Q$15:$R$67,2,FALSE)","v":"00,00"}]
["2019-01-07",7,{"$f":"VLOOKUP(A7,ENERO!B8:D38,3,FALSE)","v":""},3,14,15,16,17,18,19,20,{"$f":"VLOOKUP(Calendario!D7,Resumen!$Q$15:$R$67,2,FALSE)","v":"00,00"},7,11,12,13,14,15,16,17,{"$f":"VLOOKUP(Calendario!M7,Resumen!$Q$15:$R$67,2,FALSE)","v":"00,00"},11,11,12,13,14,15,16,17,{"$f":"VLOOKUP(Calendario!V7,Resumen!$Q$15:$R$67,2,FALSE)","v":"00,00"}]
["2019-01-08",8,{"$f":"VLOOKUP(A8,ENERO!B9:D39,3,FALSE)","v":""},4,21,22,23,24,25,26,27,{"$f":"VLOOKUP(Calendario!D8,Resumen!$Q$15:$R$67,2,FALSE)","v":"00,00"},8,18,19,20,21,22,23,24,{"$f":"VLOOKUP(Calendario!M8,Resumen!$Q$15:$R$67,2,FALSE)","v":"00,00"},12,18,19,20,21,22,23,24,{"$f":"VLOOKUP(Calendario!V8,Resumen!$Q$15:$R$67,2,FALSE)","v":"00,00"}]
["2019-01-09",9,{"$f":"VLOOKUP(A9,ENERO!B10:D40,3,FALSE)","v":""},5,28,29,30,31,null,null,null,null,9,25,26,27,28,null,null,null,null,13,25,26,27,28,29,30,31,{"$f":"VLOOKUP(Calendario!V9,Resumen!$Q$15:$R$67,2,FALSE)","v":"00,00"}]
["2019-01-10",10,{"$f":"VLOOKUP(A10,ENERO!B11:D41,3,FALSE)","v":""}]
["2019-01-11",11,{"$f":"VLOOKUP(A11,ENERO!B12:D42,3,FALSE)","v":""},null,"ABRIL(T: 0 H: 0,00)",null,null,null,null,null,null,null,null,"MAYO(T: 0 H: 0,00)",null,null,null,null,null,null,null,null,"JUNIO(T: 0 H: 0,00)"]
["2019-01-12",12,{"$f":"VLOOKUP(A12,ENERO!B13:D43,3,FALSE)","v":"Fin de semana"},null,"L","M","X","J","V","S","D","HTS",null,"L","M","X","J","V","S","D","HTS",null,"L","M","X","J","V","S","D","HTS"]
["2019-01-13",13,{"$f":"VLOOKUP(A13,ENERO!B14:D44,3,FALSE)","v":"Fin de semana"},14,1,2,3,4,5,6,7,{"$f":"VLOOKUP(Calendario!D13,Resumen!$Q$15:$R$67,2,FALSE)","v":"00,00"},18,null,null,1,2,3,4,5,{"$f":"VLOOKUP(Calendario!M13,Resumen!$Q$15:$R$67,2,FALSE)","v":"00,00"},22,null,null,null,null,null,1,2]
["2019-01-14",14,{"$f":"VLOOKUP(A14,ENERO!B15:D45,3,FALSE)","v":""},15,8,9,10,11,12,13,14,{"$f":"VLOOKUP(Calendario!D14,Resumen!$Q$15:$R$67,2,FALSE)","v":"00,00"},19,6,7,8,9,10,11,12,{"$f":"VLOOKUP(Calendario!M14,Resumen!$Q$15:$R$67,2,FALSE)","v":"00,00"},23,3,4,5,6,7,8,9,{"$f":"VLOOKUP(Calendario!V14,Resumen!$Q$15:$R$67,2,FALSE)","v":"00,00"}]
["2019-01-15",15,{"$f":"VLOOKUP(A15,ENERO!B16:D46,3,FALSE)","v":""},16,15,16,17,18,19,20,21,{"$f":"VLOOKUP(Calendario!D15,Resumen!$Q$15:$R$67,2,FALSE)","v":"00,00"},20,13,14,15,16,17,18,19,{"$f":"VLOOKUP(Calendario!M15,Resumen!$Q$15:$R$67,2,FALSE)","v":"00,00"},24,10,11,12,13,14,15,16,{"$f":"VLOOKUP(Calendario!V15,Resumen!$Q$15:$R$67,2,FALSE)","v":"00,00"}]
["2019-01-16",16,{"$f":"VLOOKUP(A16,ENERO!B17:D47,3,FALSE)","v":""},17,22,23,24,25,26,27,28,{"$f":"VLOOKUP(Calendario!D16,Resumen!$Q$15:$R$67,2,FALSE)","v":"00,00"},21,20,21,22,23,24,25,26,{"$f":"VLOOKUP(Calendario!M16,Resumen!$Q$15:$R$67,2,FALSE)","v":"00,00"},25,17,18,19,20,21,22,23,{"$f":"VLOOKUP(Calendario!V16,Resumen!$Q$15:$R$67,2,FALSE)","v":"00,00"}]
["2019-01-17",17,{"$f":"VLOOKUP(A17,ENERO!B18:D48,3,FALSE)","v":""},18,29,30,null,null,null,null,null,null,22,27,28,29,30,31,null,null,{"$f":"VLOOKUP(Calendario!M17,Resumen!$Q$15:$R$67,2,FALSE)","v":"00,00"},26,24,25,26,27,28,29,30,{"$f":"VLOOKUP(Calendario!V17,Resumen!$Q$15:$R$67,2,FALSE)","v":"00,00"}]
["2019-01-18",18,{"$f":"VLOOKUP(A18,ENERO!B19:D49,3,FALSE)","v":""}]
["2019-01-19",19,{"$f":"VLOOKUP(A19,ENERO!B20:D50,3,FALSE)","v":"Fin de semana"},null,"JULIO(T: 0 H: 0,00)",null,null,null,null,null,null,null,null,"AGOSTO(T: 0 H: 0,00)",null,null,null,null,null,null,null,null,"SEPTIEMBRE(T: 0 H: 0,00)"]
["2019-01-20",20,{"$f":"VLOOKUP(A20,ENERO!B21:D51,3,FALSE)","v":"Fin de semana"},null,"L","M","X","J","V","S","D","HTS",null,"L","M","X","J","V","S","D","HTS",null,"L","M","X","J","V","S","D","HTS"]
["2019-01-21",21,{"$f":"VLOOKUP(A21,ENERO!B22:D52,3,FALSE)","v":""},27,1,2,3,4,5,6,7,{"$f":"VLOOKUP(Calendario!D21,Resumen!$Q$15:$R$67,2,FALSE)","v":"00,00"},31,null,null,null,1,2,3,4,{"$f":"VLOOKUP(Calendario!M21,Resumen!$Q$15:$R$67,2,FALSE)","v":"00,00"},35,null,null,null,null,null,null,1]
["2019-01-22",22,{"$f":"VLOOKUP(A22,ENERO!B23:D53,3,FALSE)","v":""},28,8,9,10,11,12,13,14,{"$f":"VLOOKUP(Calendario!D22,Resumen!$Q$15:$R$67,2,FALSE)","v":"00,00"},32,5,6,7,8,9,10,11,{"$f":"VLOOKUP(Calendario!M22,Resumen!$Q$15:$R$67,2,FALSE)","v":"00,00"},36,2,3,4,5,6,7,8,{"$f":"VLOOKUP(Calendario!V22,Resumen!$Q$15:$R$67,2,FALSE)","v":"00,00"}]
["2019-01-23",23,{"$f":"VLOOKUP(A23,ENERO!B24:D54,3,FALSE)","v":""},29,15,16,17,18,19,20,21,{"$f":"VLOOKUP(Calendario!D23,Resumen!$Q$15:$R$67,2,FALSE)","v":"00,00"},33,12,13,14,15,16,17,18,{"$f":"VLOOKUP(Calendario!M23,Resumen!$Q$15:$R$67,2,FALSE)","v":"00,00"},37,9,10,11,12,13,14,15,{"$f":"VLOOKUP(Calendario!V23,Resumen!$Q$15:$R$67,2,FALSE)","v":"00,00"}]
["2019-01-24",24,{"$f":"VLOOKUP(A24,ENERO!B25:D55,3,FALSE)","v":""},30,22,23,24,25,26,27,28,{"$f":"VLOOKUP(Calendario!D24,Resumen!$Q$15:$R$67,2,FALSE)","v":"00,00"},34,19,20,21,22,23,24,25,{"$f":"VLOOKUP(Calendario!M24,Resumen!$Q$15:$R$67,2,FALSE)","v":"00,00"},38,16,17,18,19,20,21,22,{"$f":"VLOOKUP(Calendario!V24,Resumen!$Q$15:$R$67,2,FALSE)","v":"00,00"}]
["2019-01-25",25,{"$f":"VLOOKUP(A25,ENERO!B26:D56,3,FALSE)","v":""},31,29,30,31,null,null,null,null,null,35,26,27,28,29,30,31,null,{"$f":"VLOOKUP(Calendario!M25,Resumen!$Q$15:$R$67,2,FALSE)","v":"00,00"},39,23,24,25,26,27,28,29,{"$f":"VLOOKUP(Calendario!V25,Resumen!$Q$15:$R$67,2,FALSE)","v":"00,00"}]
["2019-01-26",26,{"$f":"VLOOKUP(A26,ENERO!B27:D57,3,FALSE)","v":"Fin de semana"},null,null,null,null,null,null,null,null,null,null,null,null,null,null,null,null,null,null,40,30]
["2019-01-27",27,{"$f":"VLOOKUP(A27,ENERO!B28:D58,3,FALSE)","v":"Fin de semana"},null,"OCTUBRE(T: 0 H: 0,00)",null,null,null,null,null,null,null,null,"NOVIEMBRE(T: 0 H: 0,00)",null,null,null,null,null,null,null,null,"DICIEMBRE(T: 0 H: 0,00)"]
["2019-01-28",28,{"$f":"VLOOKUP(A28,ENERO!B29:D59,3,FALSE)","v":""},null,"L","M","X","J","V","S","D","HTS",null,"L","M","X","J","V","S","D","HTS",null,"L","M","X","J","V","S","D","HTS"]
["2019-01-29",29,{"$f":"VLOOKUP(A29,ENERO!B30:D60,3,FALSE)","v":""},40,null,1,2,3,4,5,6,{"$f":"VLOOKUP(Calendario!D29,Resumen!$Q$15:$R$67,2,FALSE)","v":"00,00"},44,null,null,null,null,1,2,3,null,48,null,null,null,null,null,null,1]
["2019-01-30",30,{"$f":"VLOOKUP(A30,ENERO!B31:D61,3,FALSE)","v":""},41,7,8,9,10,11,12,13,{"$f":"VLOOKUP(Calendario!D30,Resumen!$Q$15:$R$67,2,FALSE)","v":"00,00"},45,4,5,6,7,8,9,10,{"$f":"VLOOKUP(Calendario!M30,Resumen!$Q$15:$R$67,2,FALSE)","v":"00,00"},49,2,3,4,5,6,7,8,{"$f":"VLOOKUP(Calendario!V30,Resumen!$Q$15:$R$67,2,FALSE)","v":"00,00"}]
["2019-01-31",31,{"$f":"VLOOKUP(A31,ENERO!B32:D62,3,FALSE)","v":""},42,14,15,16,17,18,19,20,{"$f":"VLOOKUP(Calendario!D31,Resumen!$Q$15:$R$67,2,FALSE)","v":"00,00"},46,11,12,13,14,15,16,17,{"$f":"VLOOKUP(Calendario!M31,Resumen!$Q$15:$R$67,2,FALSE)","v":"00,00"},50,9,10,11,12,13,14,15,{"$f":"VLOOKUP(Calendario!V31,Resumen!$Q$15:$R$67,2,FALSE)","v":"00,00"}]
["2019-02-01",1,{"$f":"VLOOKUP(A32,FEBRERO!B2:D32,3,FALSE)","v":""},43,21,22,23,24,25,26,27,{"$f":"VLOOKUP(Calendario!D32,Resumen!$Q$15:$R$67,2,FALSE)","v":"00,00"},47,18,19,20,21,22,23,24,{"$f":"VLOOKUP(Calendario!M32,Resumen!$Q$15:$R$67,2,FALSE)","v":"00,00"},51,16,17,18,19,20,21,22,{"$f":"VLOOKUP(Calendario!V32,Resumen!$Q$15:$R$67,2,FALSE)","v":"00,00"}]
["2019-02-02",2,{"$f":"VLOOKUP(A33,FEBRERO!B3:D33,3,FALSE)","v":"Fin de semana"},44,28,29,30,31,null,null,null,{"$f":"VLOOKUP(Calendario!D33,Resumen!$Q$15:$R$67,2,FALSE)","v":"00,00"},48,25,26,27,28,29,30,null,{"$f":"VLOOKUP(Calendario!M33,Resumen!$Q$15:$R$67,2,FALSE)","v":"00,00"},52,23,24,25,26,27,28,29,{"$f":"VLOOKUP(Calendario!V33,Resumen!$Q$15:$R$67,2,FALSE)","v":"00,00"}]
["2019-02-03",3,{"$f":"VLOOKUP(A34,FEBRERO!B4:D34,3,FALSE)","v":"Fin de semana"},null,null,null,null,null,null,null,null,null,null,null,null,null,null,null,null,null,null,53,30,31,null,null,null,null,null,{"$f":"VLOOKUP(Calendario!V34,Resumen!$Q$15:$R$67,2,FALSE)","v":"00,00"}]
["2019-02-04",4,{"$f":"VLOOKUP(A35,FEBRERO!B5:D35,3,FALSE)","v":""}]
["2019-02-05",5,{"$f":"VLOOKUP(A36,FEBRERO!B6:D36,3,FALSE)","v":""}]
["2019-02-06",6,{"$f":"VLOOKUP(A37,FEBRERO!B7:D37,3,FALSE)","v":""}]
["2019-02-07",7,{"$f":"VLOOKUP(A38,FEBRERO!B8:D38,3,FALSE)","v":""}]
["2019-02-08",8,{"$f":"VLOOKUP(A39,FEBRERO!B9:D39,3,FALSE)","v":""}]
["2019-02-09",9,{"$f":"VLOOKUP(A40,FEBRERO!B10:D40,3,FALSE)","v":"Fin de semana"}]
["2019-02-10",10,{"$f":"VLOOKUP(A41,FEBRERO!B11:D41,3,FALSE)","v":"Fin de semana"}]
["2019-02-11",11,{"$f":"VLOOKUP(A42,FEBRERO!B12:D42,3,FALSE)","v":""}]
["2019-02-12",12,{"$f":"VLOOKUP(A43,FEBRERO!B13:D43,3,FALSE)","v":""}]
["2019-02-13",13,{"$f":"VLOOKUP(A44,FEBRERO!B14:D44,3,FALSE)","v":""}]
["2019-02-14",14,{"$f":"VLOOKUP(A45,FEBRERO!B15:D45,3,FALSE)","v":""}]
["2019-02-15",15,{"$f":"VLOOKUP(A46,FEBRERO!B16:D46,3,FALSE)","v":""}]
["2019-02-16",16,{"$f":"VLOOKUP(A47,FEBRERO!B17:D47,3,FALSE)","v":"Fin de semana"}]
["2019-02-17",17,{"$f":"VLOOKUP(A48,FEBRERO!B18:D48,3,FALSE)","v":"Fin de semana"}]
["2019-02-18",18,{"$f":"VLOOKUP(A49,FEBRERO!B19:D49,3,FALSE)","v":""}]
["2019-02-19",19,{"$f":"VLOOKUP(A50,FEBRERO!B20:D50,3,FALSE)","v":""}]
["2019-02-20",20,{"$f":"VLOOKUP(A51,FEBRERO!B21:D51,3,FALSE)","v":""}]
["2019-02-21",21,{"$f":"VLOOKUP(A52,FEBRERO!B22:D52,3,FALSE)","v":""}]
["2019-02-22",22,{"$f":"VLOOKUP(A53,FEBRERO!B23:D53,3,FALSE)","v":""}]
["2019-02-23",23,{"$f":"VLOOKUP(A54,FEBRERO!B24:D54,3,FALSE)","v":"Fin de semana"}]
["2019-02-24",24,{"$f":"VLOOKUP(A55,FEBRERO!B25:D55,3,FALSE)","v":"Fin de semana"}]
["2019-02-25",25,{"$f":"VLOOKUP(A56,FEBRERO!B26:D56,3,FALSE)","v":""}]
["2019-02-26",26,{"$f":"VLOOKUP(A57,FEBRERO!B27:D57,3,FALSE)","v":""}]
["2019-02-27",27,{"$f":"VLOOKUP(A58,FEBRERO!B28:D58,3,FALSE)","v":""}]
["2019-02-28",28,{"$f":"VLOOKUP(A59,FEBRERO!B29:D59,3,FALSE)","v":""}]
["2019-03-01",1,{"$f":"VLOOKUP(A60,MARZO!B2:D32,3,FALSE)","v":""}]
["2019-03-02",2,{"$f":"VLOOKUP(A61,MARZO!B3:D33,3,FALSE)","v":"Fin de semana"}]
["2019-03-03",3,{"$f":"VLOOKUP(A62,MARZO!B4:D34,3,FALSE)","v":"Fin de semana"}]
["2019-03-04",4,{"$f":"VLOOKUP(A63,MARZO!B5:D35,3,FALSE)","v":""}]
["2019-03-05",5,{"$f":"VLOOKUP(A64,MARZO!B6:D36,3,FALSE)","v":""}]
["2019-03-06",6,{"$f":"VLOOKUP(A65,MARZO!B7:D37,3,FALSE)","v":""}]
["2019-03-07",7,{"$f":"VLOOKUP(A66,MARZO!B8:D38,3,FALSE)","v":""}]
["2019-03-08",8,{"$f":"VLOOKUP(A67,MARZO!B9:D39,3,FALSE)","v":""}]
["2019-03-09",9,{"$f":"VLOOKUP(A68,MARZO!B10:D40,3,FALSE)","v":"Fin de semana"}]
["2019-03-10",10,{"$f":"VLOOKUP(A69,MARZO!B11:D41,3,FALSE)","v":"Fin de semana"}]
["2019-03-11",11,{"$f":"VLOOKUP(A70,MARZO!B12:D42,3,FALSE)","v":""}]
["2019-03-12",12,{"$f":"VLOOKUP(A71,MARZO!B13:D43,3,FALSE)","v":""}]
["2019-03-13",13,{"$f":"VLOOKUP(A72,MARZO!B14:D44,3,FALSE)","v":""}]
["2019-03-14",14,{"$f":"VLOOKUP(A73,MARZO!B15:D45,3,FALSE)","v":""}]
["2019-03-15",15,{"$f":"VLOOKUP(A74,MARZO!B16:D46,3,FALSE)","v":""}]
["2019-03-16",16,{"$f":"VLOOKUP(A75,MARZO!B17:D47,3,FALSE)","v":"Fin de semana"}]
["2019-03-17",17,{"$f":"VLOOKUP(A76,MARZO!B18:D48,3,FALSE)","v":"Fin de semana"}]
["2019-03-18",18,{"$f":"VLOOKUP(A77,MARZO!B19:D49,3,FALSE)","v":""}]
["2019-03-19",19,{"$f":"VLOOKUP(A78,MARZO!B20:D50,3,FALSE)","v":""}]
["2019-03-20",20,{"$f":"VLOOKUP(A79,MARZO!B21:D51,3,FALSE)","v":""}]
["2019-03-21",21,{"$f":"VLOOKUP(A80,MARZO!B22:D52,3,FALSE)","v":""}]
["2019-03-22",22,{"$f":"VLOOKUP(A81,MARZO!B23:D53,3,FALSE)","v":""}]
["2019-03-23",23,{"$f":"VLOOKUP(A82,MARZO!B24:D54,3,FALSE)","v":"Fin de semana"}]
["2019-03-24",24,{"$f":"VLOOKUP(A83,MARZO!B25:D55,3,FALSE)","v":"Fin de semana"}]
["2019-03-25",25,{"$f":"VLOOKUP(A84,MARZO!B26:D56,3,FALSE)","v":""}]
["2019-03-26",26,{"$f":"VLOOKUP(A85,MARZO!B27:D57,3,FALSE)","v":""}]
["2019-03-27",27,{"$f":"VLOOKUP(A86,MARZO!B28:D58,3,FALSE)","v":""}]
["2019-03-28",28,{"$f":"VLOOKUP(A87,MARZO!B29:D59,3,FALSE)","v":""}]
["2019-03-29",29,{"$f":"VLOOKUP(A88,MARZO!B30:D60,3,FALSE)","v":""}]
["2019-03-30",30,{"$f":"VLOOKUP(A89,MARZO!B31:D61,3,FALSE)","v":"Fin de semana"}]
["2019-03-31",31,{"$f":"VLOOKUP(A90,MARZO!B32:D62,3,FALSE)","v":"Fin de semana"}]
["2019-04-01",1,{"$f":"VLOOKUP(A91,ABRIL!B2:D32,3,FALSE)","v":""}]
["2019-04-02",2,{"$f":"VLOOKUP(A92,ABRIL!B3:D33,3,FALSE)","v":""}]
["2019-04-03",3,{"$f":"VLOOKUP(A93,ABRIL!B4:D34,3,FALSE)","v":""}]
["2019-04-04",4,{"$f":"VLOOKUP(A94,ABRIL!B5:D35,3,FALSE)","v":""}]
["2019-04-05",5,{"$f":"VLOOKUP(A95,ABRIL!B6:D36,3,FALSE)","v":""}]
["2019-04-06",6,{"$f":"VLOOKUP(A96,ABRIL!B7:D37,3,FALSE)","v":"Fin de semana"}]
["2019-04-07",7,{"$f":"VLOOKUP(A97,ABRIL!B8:D38,3,FALSE)","v":"Fin de semana"}]
["2019-04-08",8,{"$f":"VLOOKUP(A98,ABRIL!B9:D39,3,FALSE)","v":""}]
["2019-04-09",9,{"$f":"VLOOKUP(A99,ABRIL!B10:D40,3,FALSE)","v":""}]
["2019-04-10",10,{"$f":"VLOOKUP(A100,ABRIL!B11:D41,3,FALSE)","v":""}]
["2019-04-11",11,{"$f":"VLOOKUP(A101,ABRIL!B12:D42,3,FALSE)","v":""}]
["2019-04-12",12,{"$f":"VLOOKUP(A102,ABRIL!B13:D43,3,FALSE)","v":""}]
["2019-04-13",13,{"$f":"VLOOKUP(A103,ABRIL!B14:D44,3,FALSE)","v":"Fin de semana"}]
["2019-04-14",14,{"$f":"VLOOKUP(A104,ABRIL!B15:D45,3,FALSE)","v":"Fin de semana"}]
["2019-04-15",15,{"$f":"VLOOKUP(A105,ABRIL!B16:D46,3,FALSE)","v":""}]
["2019-04-16",16,{"$f":"VLOOKUP(A106,ABRIL!B17:D47,3,FALSE)","v":""}]
["2019-04-17",17,{"$f":"VLOOKUP(A107,ABRIL!B18:D48,3,FALSE)","v":""}]
["2019-04-18",18,{"$f":"VLOOKUP(A108,ABRIL!B19:D49,3,FALSE)","v":""}]
["2019-04-19",19,{"$f":"VLOOKUP(A109,ABRIL!B20:D50,3,FALSE)","v":""}]
["2019-04-20",20,{"$f":"VLOOKUP(A110,ABRIL!B21:D51,3,FALSE)","v":"Fin de semana"}]
["2019-04-21",21,{"$f":"VLOOKUP(A111,ABRIL!B22:D52,3,FALSE)","v":"Fin de semana"}]
["2019-04-22",22,{"$f":"VLOOKUP(A112,ABRIL!B23:D53,3,FALSE)","v":""}]
["2019-04-23",23,{"$f":"VLOOKUP(A113,ABRIL!B24:D54,3,FALSE)","v":""}]
["2019-04-24",24,{"$f":"VLOOKUP(A114,ABRIL!B25:D55,3,FALSE)","v":""}]
["2019-04-25",25,{"$f":"VLOOKUP(A115,ABRIL!B26:D56,3,FALSE)","v":""}]
["2019-04-26",26,{"$f":"VLOOKUP(A116,ABRIL!B27:D57,3,FALSE)","v":""}]
["2019-04-27",27,{"$f":"VLOOKUP(A117,ABRIL!B28:D58,3,FALSE)","v":"Fin de semana"}]
["2019-04-28",28,{"$f":"VLOOKUP(A118,ABRIL!B29:D59,3,FALSE)","v":"Fin de semana"}]
["2019-04-29",29,{"$f":"VLOOKUP(A119,ABRIL!B30:D60,3,FALSE)","v":""}]
["2019-04-30",30,{"$f":"VLOOKUP(A120,ABRIL!B31:D61,3,FALSE)","v":""}]
["2019-05-01",1,{"$f":"VLOOKUP(A121,MAYO!B2:D32,3,FALSE)","v":"Festivo"}]
["2019-05-02",2,{"$f":"VLOOKUP(A122,MAYO!B3:D33,3,FALSE)","v":""}]
["2019-05-03",3,{"$f":"VLOOKUP(A123,MAYO!B4:D34,3,FALSE)","v":""}]
["2019-05-04",4,{"$f":"VLOOKUP(A124,MAYO!B5:D35,3,FALSE)","v":"Fin de semana"}]
["2019-05-05",5,{"$f":"VLOOKUP(A125,MAYO!B6:D36,3,FALSE)","v":"Fin de semana"}]
["2019-05-06",6,{"$f":"VLOOKUP(A126,MAYO!B7:D37,3,FALSE)","v":""}]
["2019-05-07",7,{"$f":"VLOOKUP(A127,MAYO!B8:D38,3,FALSE)","v":""}]
["2019-05-08",8,{"$f":"VLOOKUP(A128,MAYO!B9:D39,3,FALSE)","v":""}]
["2019-05-09",9,{"$f":"VLOOKUP(A129,MAYO!B10:D40,3,FALSE)","v":""}]
["2019-05-10",10,{"$f":"VLOOKUP(A130,MAYO!B11:D41,3,FALSE)","v":""}]
["2019-05-11",11,{"$f":"VLOOKUP(A131,MAYO!B12:D42,3,FALSE)","v":"Fin de semana"}]
["2019-05-12",12,{"$f":"VLOOKUP(A132,MAYO!B13:D43,3,FALSE)","v":"Fin de semana"}]
["2019-05-13",13,{"$f":"VLOOKUP(A133,MAYO!B14:D44,3,FALSE)","v":""}]
["2019-05-14",14,{"$f":"VLOOKUP(A134,MAYO!B15:D45,3,FALSE)","v":""}]
["2019-05-15",15,{"$f":"VLOOKUP(A135,MAYO!B16:D46,3,FALSE)","v":""}]
["2019-05-16",16,{"$f":"VLOOKUP(A136,MAYO!B17:D47,3,FALSE)","v":""}]
["2019-05-17",17,{"$f":"VLOOKUP(A137,MAYO!B18:D48,3,FALSE)","v":""}]
["2019-05-18",18,{"$f":"VLOOKUP(A138,MAYO!B19:D49,3,FALSE)","v":"Fin de semana"}]
["2019-05-19",19,{"$f":"VLOOKUP(A139,MAYO!B20:D50,3,FALSE)","v":"Fin de semana"}]
["2019-05-20",20,{"$f":"VLOOKUP(A140,MAYO!B21:D51,3,FALSE)","v":""}]
["2019-05-21",21,{"$f":"VLOOKUP(A141,MAYO!B22:D52,3,FALSE)","v":""}]
["2019-05-22",22,{"$f":"VLOOKUP(A142,MAYO!B23:D53,3,FALSE)","v":""}]
["2019-05-23",23,{"$f":"VLOOKUP(A143,MAYO!B24:D54,3,FALSE)","v":""}]
["2019-05-24",24,{"$f":"VLOOKUP(A144,MAYO!B25:D55,3,FALSE)","v":""}]
["2019-05-25",25,{"$f":"VLOOKUP(A145,MAYO!B26:D56,3,FALSE)","v":"Fin de semana"}]
["2019-05-26",26,{"$f":"VLOOKUP(A146,MAYO!B27:D57,3,FALSE)","v":"Fin de semana"}]
["2019-05-27",27,{"$f":"VLOOKUP(A147,MAYO!B28:D58,3,FALSE)","v":""}]
["2019-05-28",28,{"$f":"VLOOKUP(A148,MAYO!B29:D59,3,FALSE)","v":""}]
["2019-05-29",29,{"$f":"VLOOKUP(A149,MAYO!B30:D60,3,FALSE)","v":""}]
["2019-05-30",30,{"$f":"VLOOKUP(A150,MAYO!B31:D61,3,FALSE)","v":""}]
["2019-05-31",31,{"$f":"VLOOKUP(A151,MAYO!B32:D62,3,FALSE)","v":""}]
["2019-06-01",1,{"$f":"VLOOKUP(A152,JUNIO!B2:D32,3,FALSE)","v":"Fin de semana"}]
["2019-06-02",2,{"$f":"VLOOKUP(A153,JUNIO!B3:D33,3,FALSE)","v":"Fin de semana"}]
["2019-06-03",3,{"$f":"VLOOKUP(A154,JUNIO!B4:D34,3,FALSE)","v":""}]
["2019-06-04",4,{"$f":"VLOOKUP(A155,JUNIO!B5:D35,3,FALSE)","v":""}]
["2019-06-05",5,{"$f":"VLOOKUP(A156,JUNIO!B6:D36,3,FALSE)","v":""}]
["2019-06-06",6,{"$f":"VLOOKUP(A157,JUNIO!B7:D37,3,FALSE)","v":""}]
["2019-06-07",7,{"$f":"VLOOKUP(A158,JUNIO!B8:D38,3,FALSE)","v":""}]
["2019-06-08",8,{"$f":"VLOOKUP(A159,JUNIO!B9:D39,3,FALSE)","v":"Fin de semana"}]
["2019-06-09",9,{"$f":"VLOOKUP(A160,JUNIO!B10:D40,3,FALSE)","v":"Fin de semana"}]
["2019-06-10",10,{"$f":"VLOOKUP(A161,JUNIO!B11:D41,3,FALSE)","v":""}]
["2019-06-11",11,{"$f":"VLOOKUP(A162,JUNIO!B12:D42,3,FALSE)","v":""}]
["2019-06-12",12,{"$f":"VLOOKUP(A163,JUNIO!B13:D43,3,FALSE)","v":""}]
["2019-06-13",13,{"$f":"VLOOKUP(A164,JUNIO!B14:D44,3,FALSE)","v":""}]
["2019-06-14",14,{"$f":"VLOOKUP(A165,JUNIO!B15:D45,3,FALSE)","v":""}]
["2019-06-15",15,{"$f":"VLOOKUP(A166,JUNIO!B16:D46,3,FALSE)","v":"Fin de semana"}]
["2019-06-16",16,{"$f":"VLOOKUP(A167,JUNIO!B17:D47,3,FALSE)","v":"Fin de semana"}]
["2019-06-17",17,{"$f":"VLOOKUP(A168,JUNIO!B18:D48,3,FALSE)","v":""}]
["2019-06-18",18,{"$f":"VLOOKUP(A169,JUNIO!B19:D49,3,FALSE)","v":""}]
["2019-06-19",19,{"$f":"VLOOKUP(A170,JUNIO!B20:D50,3,FALSE)","v":""}]
["2019-06-20",20,{"$f":"VLOOKUP(A171,JUNIO!B21:D51,3,FALSE)","v":""}]
["2019-06-21",21,{"$f":"VLOOKUP(A172,JUNIO!B22:D52,3,FALSE)","v":""}]
["2019-06-22",22,{"$f":"VLOOKUP(A173,JUNIO!B23:D53,3,FALSE)","v":"Fin de semana"}]
["2019-06-23",23,{"$f":"VLOOKUP(A174,JUNIO!B24:D54,3,FALSE)","v":"Fin de semana"}]
["2019-06-24",24,{"$f":"VLOOKUP(A175,JUNIO!B25:D55,3,FALSE)","v":""}]
["2019-06-25",25,{"$f":"VLOOKUP(A176,JUNIO!B26:D56,3,FALSE)","v":""}]
["2019-06-26",26,{"$f":"VLOOKUP(A177,JUNIO!B27:D57,3,FALSE)","v":""}]
["2019-06-27",27,{"$f":"VLOOKUP(A178,JUNIO!B28:D58,3,FALSE)","v":""}]
["2019-06-28",28,{"$f":"VLOOKUP(A179,JUNIO!B29:D59,3,FALSE)","v":""}]
["2019-06-29",29,{"$f":"VLOOKUP(A180,JUNIO!B30:D60,3,FALSE)","v":"Fin de semana"}]
["2019-06-30",30,{"$f":"VLOOKUP(A181,JUNIO!B31:D61,3,FALSE)","v":"Fin de semana"}]
["2019-07-01",1,{"$f":"VLOOKUP(A182,JULIO!B2:D32,3,FALSE)","v":""}]
["2019-07-02",2,{"$f":"VLOOKUP(A183,JULIO!B3:D33,3,FALSE)","v":""}]
["2019-07-03",3,{"$f":"VLOOKUP(A184,JULIO!B4:D34,3,FALSE)","v":""}]
["2019-07-04",4,{"$f":"VLOOKUP(A185,JULIO!B5:D35,3,FALSE)","v":""}]
["2019-07-05",5,{"$f":"VLOOKUP(A186,JULIO!B6:D36,3,FALSE)","v":""}]
["2019-07-06",6,{"$f":"VLOOKUP(A187,JULIO!B7:D37,3,FALSE)","v":"Fin de semana"}]
["2019-07-07",7,{"$f":"VLOOKUP(A188,JULIO!B8:D38,3,FALSE)","v":"Fin de semana"}]
["2019-07-08",8,{"$f":"VLOOKUP(A189,JULIO!B9:D39,3,FALSE)","v":""}]
["2019-07-09",9,{"$f":"VLOOKUP(A190,JULIO!B10:D40,3,FALSE)","v":""}]
["2019-07-10",10,{"$f":"VLOOKUP(A191,JULIO!B11:D41,3,FALSE)","v":""}]
["2019-07-11",11,{"$f":"VLOOKUP(A192,JULIO!B12:D42,3,FALSE)","v":""}]
["2019-07-12",12,{"$f":"VLOOKUP(A193,JULIO!B13:D43,3,FALSE)","v":""}]
["2019-07-13",13,{"$f":"VLOOKUP(A194,JULIO!B14:D44,3,FALSE)","v":"Fin de semana"}]
["2019-07-14",14,{"$f":"VLOOKUP(A195,JULIO!B15:D45,3,FALSE)","v":"Fin de semana"}]
["2019-07-15",15,{"$f":"VLOOKUP(A196,JULIO!B16:D46,3,FALSE)","v":""}]
["2019-07-16",16,{"$f":"VLOOKUP(A197,JULIO!B17:D47,3,FALSE)","v":""}]
["2019-07-17",17,{"$f":"VLOOKUP(A198,JULIO!B18:D48,3,FALSE)","v":""}]
["2019-07-18",18,{"$f":"VLOOKUP(A199,JULIO!B19:D49,3,FALSE)","v":""}]
["2019-07-19",19,{"$f":"VLOOKUP(A200,JULIO!B20:D50,3,FALSE)","v":""}]
["2019-07-20",20,{"$f":"VLOOKUP(A201,JULIO!B21:D51,3,FALSE)","v":"Fin de semana"}]
["2019-07-21",21,{"$f":"VLOOKUP(A202,JULIO!B22:D52,3,FALSE)","v":"Fin de semana"}]
["2019-07-22",22,{"$f":"VLOOKUP(A203,JULIO!B23:D53,3,FALSE)","v":""}]
["2019-07-23",23,{"$f":"VLOOKUP(A204,JULIO!B24:D54,3,FALSE)","v":""}]
["2019-07-24",24,{"$f":"VLOOKUP(A205,JULIO!B25:D55,3,FALSE)","v":""}]
["2019-07-25",25,{"$f":"VLOOKUP(A206,JULIO!B26:D56,3,FALSE)","v":""}]
["2019-07-26",26,{"$f":"VLOOKUP(A207,JULIO!B27:D57,3,FALSE)","v":""}]
["2019-07-27",27,{"$f":"VLOOKUP(A208,JULIO!B28:D58,3,FALSE)","v":"Fin de semana"}]
["2019-07-28",28,{"$f":"VLOOKUP(A209,JULIO!B29:D59,3,FALSE)","v":"Fin de semana"}]
["2019-07-29",29,{"$f":"VLOOKUP(A210,JULIO!B30:D60,3,FALSE)","v":""}]
["2019-07-30",30,{"$f":"VLOOKUP(A211,JULIO!B31:D61,3,FALSE)","v":""}]
["2019-07-31",31,{"$f":"VLOOKUP(A212,JULIO!B32:D62,3,FALSE)","v":""}]
["2019-08-01",1,{"$f":"VLOOKUP(A213,AGOSTO!B2:D32,3,FALSE)","v":""}]
["2019-08-02",2,{"$f":"VLOOKUP(A214,AGOSTO!B3:D33,3,FALSE)","v":""}]
["2019-08-03",3,{"$f":"VLOOKUP(A215,AGOSTO!B4:D34,3,FALSE)","v":"Fin de semana"}]
["2019-08-04",4,{"$f":"VLOOKUP(A216,AGOSTO!B5:D35,3,FALSE)","v":"Fin de semana"}]
["2019-08-05",5,{"$f":"VLOOKUP(A217,AGOSTO!B6:D36,3,FALSE)","v":""}]
["2019-08-06",6,{"$f":"VLOOKUP(A218,AGOSTO!B7:D37,3,FALSE)","v":""}]
["2019-08-07",7,{"$f":"VLOOKUP(A219,AGOSTO!B8:D38,3,FALSE)","v":""}]
["2019-08-08",8,{"$f":"VLOOKUP(A220,AGOSTO!B9:D39,3,FALSE)","v":""}]
["2019-08-09",9,{"$f":"VLOOKUP(A221,AGOSTO!B10:D40,3,FALSE)","v":""}]
["2019-08-10",10,{"$f":"VLOOKUP(A222,AGOSTO!B11:D41,3,FALSE)","v":"Fin de semana"}]
["2019-08-11",11,{"$f":"VLOOKUP(A223,AGOSTO!B12:D42,3,FALSE)","v":"Fin de semana"}]
["2019-08-12",12,{"$f":"VLOOKUP(A224,AGOSTO!B13:D43,3,FALSE)","v":""}]
["2019-08-13",13,{"$f":"VLOOKUP(A225,AGOSTO!B14:D44,3,FALSE)","v":""}]
["2019-08-14",14,{"$f":"VLOOKUP(A226,AGOSTO!B15:D45,3,FALSE)","v":""}]
["2019-08-15",15,{"$f":"VLOOKUP(A227,AGOSTO!B16:D46,3,FALSE)","v":"Festivo"}]
["2019-08-16",16,{"$f":"VLOOKUP(A228,AGOSTO!B17:D47,3,FALSE)","v":""}]
["2019-08-17",17,{"$f":"VLOOKUP(A229,AGOSTO!B18:D48,3,FALSE)","v":"Fin de semana"}]
["2019-08-18",18,{"$f":"VLOOKUP(A230,AGOSTO!B19:D49,3,FALSE)","v":"Fin de semana"}]
["2019-08-19",19,{"$f":"VLOOKUP(A231,AGOSTO!B20:D50,3,FALSE)","v":""}]
["2019-08-20",20,{"$f":"VLOOKUP(A232,AGOSTO!B21:D51,3,FALSE)","v":""}]
["2019-08-21",21,{"$f":"VLOOKUP(A233,AGOSTO!B22:D52,3,FALSE)","v":""}]
["2019-08-22",22,{"$f":"VLOOKUP(A234,AGOSTO!B23:D53,3,FALSE)","v":""}]
["2019-08-23",23,{"$f":"VLOOKUP(A235,AGOSTO!B24:D54,3,FALSE)","v":""}]
["2019-08-24",24,{"$f":"VLOOKUP(A236,AGOSTO!B25:D55,3,FALSE)","v":"Fin de semana"}]
["2019-08-25",25,{"$f":"VLOOKUP(A237,AGOSTO!B26:D56,3,FALSE)","v":"Fin de semana"}]
["2019-08-26",26,{"$f":"VLOOKUP(A238,AGOSTO!B27:D57,3,FALSE)","v":""}]
["2019-08-27",27,{"$f":"VLOOKUP(A239,AGOSTO!B28:D58,3,FALSE)","v":""}]
["2019-08-28",28,{"$f":"VLOOKUP(A240,AGOSTO!B29:D59,3,FALSE)","v":""}]
["2019-08-29",29,{"$f":"VLOOKUP(A241,AGOSTO!B30:D60,3,FALSE)","v":""}]
["2019-08-30",30,{"$f":"VLOOKUP(A242,AGOSTO!B31:D61,3,FALSE)","v":""}]
["2019-08-31",31,{"$f":"VLOOKUP(A243,AGOSTO!B32:D62,3,FALSE)","v":"Fin de semana"}]
["2019-09-01",1,{"$f":"VLOOKUP(A244,SEPTIEMBRE!B2:D32,3,FALSE)","v":"Fin de semana"}]
["2019-09-02",2,{"$f":"VLOOKUP(A245,SEPTIEMBRE!B3:D33,3,FALSE)","v":""}]
["2019-09-03",3,{"$f":"VLOOKUP(A246,SEPTIEMBRE!B4:D34,3,FALSE)","v":""}]
["2019-09-04",4,{"$f":"VLOOKUP(A247,SEPTIEMBRE!B5:D35,3,FALSE)","v":""}]
["2019-09-05",5,{"$f":"VLOOKUP(A248,SEPTIEMBRE!B6:D36,3,FALSE)","v":""}]
["2019-09-06",6,{"$f":"VLOOKUP(A249,SEPTIEMBRE!B7:D37,3,FALSE)","v":""}]
["2019-09-07",7,{"$f":"VLOOKUP(A250,SEPTIEMBRE!B8:D38,3,FALSE)","v":"Fin de semana"}]
["2019-09-08",8,{"$f":"VLOOKUP(A251,SEPTIEMBRE!B9:D39,3,FALSE)","v":"Fin de semana"}]
["2019-09-09",9,{"$f":"VLOOKUP(A252,SEPTIEMBRE!B10:D40,3,FALSE)","v":""}]
["2019-09-10",10,{"$f":"VLOOKUP(A253,SEPTIEMBRE!B11:D41,3,FALSE)","v":""}]
["2019-09-11",11,{"$f":"VLOOKUP(A254,SEPTIEMBRE!B12:D42,3,FALSE)","v":""}]
["2019-09-12",12,{"$f":"VLOOKUP(A255,SEPTIEMBRE!B13:D43,3,FALSE)","v":""}]
["2019-09-13",13,{"$f":"VLOOKUP(A256,SEPTIEMBRE!B14:D44,3,FALSE)","v":""}]
["2019-09-14",14,{"$f":"VLOOKUP(A257,SEPTIEMBRE!B15:D45,3,FALSE)","v":"Fin de semana"}]
["2019-09-15",15,{"$f":"VLOOKUP(A258,SEPTIEMBRE!B16:D46,3,FALSE)","v":"Fin de semana"}]
["2019-09-16",16,{"$f":"VLOOKUP(A259,SEPTIEMBRE!B17:D47,3,FALSE)","v":""}]
["2019-09-17",17,{"$f":"VLOOKUP(A260,SEPTIEMBRE!B18:D48,3,FALSE)","v":""}]
["2019-09-18",18,{"$f":"VLOOKUP(A261,SEPTIEMBRE!B19:D49,3,FALSE)","v":""}]
["2019-09-19",19,{"$f":"VLOOKUP(A262,SEPTIEMBRE!B20:D50,3,FALSE)","v":""}]
["2019-09-20",20,{"$f":"VLOOKUP(A263,SEPTIEMBRE!B21:D51,3,FALSE)","v":""}]
["2019-09-21",21,{"$f":"VLOOKUP(A264,SEPTIEMBRE!B22:D52,3,FALSE)","v":"Fin de semana"}]
["2019-09-22",22,{"$f":"VLOOKUP(A265,SEPTIEMBRE!B23:D53,3,FALSE)","v":"Fin de semana"}]
["2019-09-23",23,{"$f":"VLOOKUP(A266,SEPTIEMBRE!B24:D54,3,FALSE)","v":""}]
["2019-09-24",24,{"$f":"VLOOKUP(A267,SEPTIEMBRE!B25:D55,3,FALSE)","v":""}]
["2019-09-25",25,{"$f":"VLOOKUP(A268,SEPTIEMBRE!B26:D56,3,FALSE)","v":""}]
["2019-09-26",26,{"$f":"VLOOKUP(A269,SEPTIEMBRE!B27:D57,3,FALSE)","v":""}]
["2019-09-27",27,{"$f":"VLOOKUP(A270,SEPTIEMBRE!B28:D58,3,FALSE)","v":""}]
["2019-09-28",28,{"$f":"VLOOKUP(A271,SEPTIEMBRE!B29:D59,3,FALSE)","v":"Fin de semana"}]
["2019-09-29",29,{"$f":"VLOOKUP(A272,SEPTIEMBRE!B30:D60,3,FALSE)","v":"Fin de semana"}]
["2019-09-30",30,{"$f":"VLOOKUP(A273,SEPTIEMBRE!B31:D61,3,FALSE)","v":""}]
["2019-10-01",1,{"$f":"VLOOKUP(A274,OCTUBRE!B2:D32,3,FALSE)","v":""}]
["2019-10-02",2,{"$f":"VLOOKUP(A275,OCTUBRE!B3:D33,3,FALSE)","v":""}]
["2019-10-03",3,{"$f":"VLOOKUP(A276,OCTUBRE!B4:D34,3,FALSE)","v":""}]
["2019-10-04",4,{"$f":"VLOOKUP(A277,OCTUBRE!B5:D35,3,FALSE)","v":""}]
["2019-10-05",5,{"$f":"VLOOKUP(A278,OCTUBRE!B6:D36,3,FALSE)","v":"Fin de semana"}]
["2019-10-06",6,{"$f":"VLOOKUP(A279,OCTUBRE!B7:D37,3,FALSE)","v":"Fin de semana"}]
["2019-10-07",7,{"$f":"VLOOKUP(A280,OCTUBRE!B8:D38,3,FALSE)","v":""}]
["2019-10-08",8,{"$f":"VLOOKUP(A281,OCTUBRE!B9:D39,3,FALSE)","v":""}]
["2019-10-09",9,{"$f":"VLOOKUP(A282,OCTUBRE!B10:D40,3,FALSE)","v":""}]
["2019-10-10",10,{"$f":"VLOOKUP(A283,OCTUBRE!B11:D41,3,FALSE)","v":""}]
["2019-10-11",11,{"$f":"VLOOKUP(A284,OCTUBRE!B12:D42,3,FALSE)","v":""}]
["2019-10-12",12,{"$f":"VLOOKUP(A285,OCTUBRE!B13:D43,3,FALSE)","v":"Festivo"}]
["2019-10-13",13,{"$f":"VLOOKUP(A286,OCTUBRE!B14:D44,3,FALSE)","v":"Fin de semana"}]
["2019-10-14",14,{"$f":"VLOOKUP(A287,OCTUBRE!B15:D45,3,FALSE)","v":""}]
["2019-10-15",15,{"$f":"VLOOKUP(A288,OCTUBRE!B16:D46,3,FALSE)","v":""}]
["2019-10-16",16,{"$f":"VLOOKUP(A289,OCTUBRE!B17:D47,3,FALSE)","v":""}]
["2019-10-17",17,{"$f":"VLOOKUP(A290,OCTUBRE!B18:D48,3,FALSE)","v":""}]
["2019-10-18",18,{"$f":"VLOOKUP(A291,OCTUBRE!B19:D49,3,FALSE)","v":""}]
["2019-10-19",19,{"$f":"VLOOKUP(A292,OCTUBRE!B20:D50,3,FALSE)","v":"Fin de semana"}]
["2019-10-20",20,{"$f":"VLOOKUP(A293,OCTUBRE!B21:D51,3,FALSE)","v":"Fin de semana"}]
["2019-10-21",21,{"$f":"VLOOKUP(A294,OCTUBRE!B22:D52,3,FALSE)","v":""}]
["2019-10-22",22,{"$f":"VLOOKUP(A295,OCTUBRE!B23:D53,3,FALSE)","v":""}]
["2019-10-23",23,{"$f":"VLOOKUP(A296,OCTUBRE!B24:D54,3,FALSE)","v":""}]
["2019-10-24",24,{"$f":"VLOOKUP(A297,OCTUBRE!B25:D55,3,FALSE)","v":""}]
["2019-10-25",25,{"$f":"VLOOKUP(A298,OCTUBRE!B26:D56,3,FALSE)","v":""}]
["2019-10-26",26,{"$f":"VLOOKUP(A299,OCTUBRE!B27:D57,3,FALSE)","v":"Fin de semana"}]
["2019-10-27",27,{"$f":"VLOOKUP(A300,OCTUBRE!B28:D58,3,FALSE)","v":"Fin de semana"}]
["2019-10-28",28,{"$f":"VLOOKUP(A301,OCTUBRE!B29:D59,3,FALSE)","v":""}]
["2019-10-29",29,{"$f":"VLOOKUP(A302,OCTUBRE!B30:D60,3,FALSE)","v":""}]
["2019-10-30",30,{"$f":"VLOOKUP(A303,OCTUBRE!B31:D61,3,FALSE)","v":""}]
["2019-10-31",31,{"$f":"VLOOKUP(A304,OCTUBRE!B32:D62,3,FALSE)","v":""}]
["2019-11-01",1,{"$f":"VLOOKUP(A305,NOVIEMBRE!B2:D32,3,FALSE)","v":"Festivo"}]
["2019-11-02",2,{"$f":"VLOOKUP(A306,NOVIEMBRE!B3:D33,3,FALSE)","v":"Fin de semana"}]
["2019-11-03",3,{"$f":"VLOOKUP(A307,NOVIEMBRE!B4:D34,3,FALSE)","v":"Fin de semana"}]
["2019-11-04",4,{"$f":"VLOOKUP(A308,NOVIEMBRE!B5:D35,3,FALSE)","v":""}]
["2019-11-05",5,{"$f":"VLOOKUP(A309,NOVIEMBRE!B6:D36,3,FALSE)","v":""}]
["2019-11-06",6,{"$f":"VLOOKUP(A310,NOVIEMBRE!B7:D37,3,FALSE)","v":""}]
["2019-11-07",7,{"$f":"VLOOKUP(A311,NOVIEMBRE!B8:D38,3,FALSE)","v":""}]
["2019-11-08",8,{"$f":"VLOOKUP(A312,NOVIEMBRE!B9:D39,3,FALSE)","v":""}]
["2019-11-09",9,{"$f":"VLOOKUP(A313,NOVIEMBRE!B10:D40,3,FALSE)","v":"Fin de semana"}]
["2019-11-10",10,{"$f":"VLOOKUP(A314,NOVIEMBRE!B11:D41,3,FALSE)","v":"Fin de semana"}]
["2019-11-11",11,{"$f":"VLOOKUP(A315,NOVIEMBRE!B12:D42,3,FALSE)","v":""}]
["2019-11-12",12,{"$f":"VLOOKUP(A316,NOVIEMBRE!B13:D43,3,FALSE)","v":""}]
["2019-11-13",13,{"$f":"VLOOKUP(A317,NOVIEMBRE!B14:D44,3,FALSE)","v":""}]
["2019-11-14",14,{"$f":"VLOOKUP(A318,NOVIEMBRE!B15:D45,3,FALSE)","v":""}]
["2019-11-15",15,{"$f":"VLOOKUP(A319,NOVIEMBRE!B16:D46,3,FALSE)","v":""}]
["2019-11-16",16,{"$f":"VLOOKUP(A320,NOVIEMBRE!B17:D47,3,FALSE)","v":"Fin de semana"}]
["2019-11-17",17,{"$f":"VLOOKUP(A321,NOVIEMBRE!B18:D48,3,FALSE)","v":"Fin de semana"}]
["2019-11-18",18,{"$f":"VLOOKUP(A322,NOVIEMBRE!B19:D49,3,FALSE)","v":""}]
["2019-11-19",19,{"$f":"VLOOKUP(A323,NOVIEMBRE!B20:D50,3,FALSE)","v":""}]
["2019-11-20",20,{"$f":"VLOOKUP(A324,NOVIEMBRE!B21:D51,3,FALSE)","v":""}]
["2019-11-21",21,{"$f":"VLOOKUP(A325,NOVIEMBRE!B22:D52,3,FALSE)","v":""}]
["2019-11-22",22,{"$f":"VLOOKUP(A326,NOVIEMBRE!B23:D53,3,FALSE)","v":""}]
["2019-11-23",23,{"$f":"VLOOKUP(A327,NOVIEMBRE!B24:D54,3,FALSE)","v":"Fin de semana"}]
["2019-11-24",24,{"$f":"VLOOKUP(A328,NOVIEMBRE!B25:D55,3,FALSE)","v":"Fin de semana"}]
["2019-11-25",25,{"$f":"VLOOKUP(A329,NOVIEMBRE!B26:D56,3,FALSE)","v":""}]
["2019-11-26",26,{"$f":"VLOOKUP(A330,NOVIEMBRE!B27:D57,3,FALSE)","v":""}]
["2019-11-27",27,{"$f":"VLOOKUP(A331,NOVIEMBRE!B28:D58,3,FALSE)","v":""}]
["2019-11-28",28,{"$f":"VLOOKUP(A332,NOVIEMBRE!B29:D59,3,FALSE)","v":""}]
["2019-11-29",29,{"$f":"VLOOKUP(A333,NOVIEMBRE!B30:D60,3,FALSE)","v":""}]
["2019-11-30",30,{"$f":"VLOOKUP(A334,NOVIEMBRE!B31:D61,3,FALSE)","v":"Fin de semana"}]
["2019-12-01",1,{"$f":"VLOOKUP(A335,DICIEMBRE!B2:D32,3,FALSE)","v":"Fin de semana"}]
["2019-12-02",2,{"$f":"VLOOKUP(A336,DICIEMBRE!B3:D33,3,FALSE)","v":""}]
["2019-12-03",3,{"$f":"VLOOKUP(A337,DICIEMBRE!B4:D34,3,FALSE)","v":""}]
["2019-12-04",4,{"$f":"VLOOKUP(A338,DICIEMBRE!B5:D35,3,FALSE)","v":""}]
["2019-12-05",5,{"$f":"VLOOKUP(A339,DICIEMBRE!B6:D36,3,FALSE)","v":""}]
["2019-12-06",6,{"$f":"VLOOKUP(A340,DICIEMBRE!B7:D37,3,FALSE)","v":"Festivo"}]
["2019-12-07",7,{"$f":"VLOOKUP(A341,DICIEMBRE!B8:D38,3,FALSE)","v":"Fin de semana"}]
["2019-12-08",8,{"$f":"VLOOKUP(A342,DICIEMBRE!B9:D39,3,FALSE)","v":"Fin de semana"}]
["2019-12-09",9,{"$f":"VLOOKUP(A343,DICIEMBRE!B10:D40,3,FALSE)","v":""}]
["2019-12-10",10,{"$f":"VLOOKUP(A344,DICIEMBRE!B11:D41,3,FALSE)","v":""}]
["2019-12-11",11,{"$f":"VLOOKUP(A345,DICIEMBRE!B12:D42,3,FALSE)","v":""}]
["2019-12-12",12,{"$f":"VLOOKUP(A346,DICIEMBRE!B13:D43,3,FALSE)","v":""}]
["2019-12-13",13,{"$f":"VLOOKUP(A347,DICIEMBRE!B14:D44,3,FALSE)","v":""}]
["2019-12-14",14,{"$f":"VLOOKUP(A348,DICIEMBRE!B15:D45,3,FALSE)","v":"Fin de semana"}]
["2019-12-15",15,{"$f":"VLOOKUP(A349,DICIEMBRE!B16:D46,3,FALSE)","v":"Fin de semana"}]
["2019-12-16",16,{"$f":"VLOOKUP(A350,DICIEMBRE!B17:D47,3,FALSE)","v":""}]
["2019-12-17",17,{"$f":"VLOOKUP(A351,DICIEMBRE!B18:D48,3,FALSE)","v":""}]
["2019-12-18",18,{"$f":"VLOOKUP(A352,DICIEMBRE!B19:D49,3,FALSE)","v":""}]
["2019-12-19",19,{"$f":"VLOOKUP(A353,DICIEMBRE!B20:D50,3,FALSE)","v":""}]
["2019-12-20",20,{"$f":"VLOOKUP(A354,DICIEMBRE!B21:D51,3,FALSE)","v":""}]
["2019-12-21",21,{"$f":"VLOOKUP(A355,DICIEMBRE!B22:D52,3,FALSE)","v":"Fin de semana"}]
["2019-12-22",22,{"$f":"VLOOKUP(A356,DICIEMBRE!B23:D53,3,FALSE)","v":"Fin de semana"}]
["2019-12-23",23,{"$f":"VLOOKUP(A357,DICIEMBRE!B24:D54,3,FALSE)","v":""}]
["2019-12-24",24,{"$f":"VLOOKUP(A358,DICIEMBRE!B25:D55,3,FALSE)","v":""}]
["2019-12-25",25,{"$f":"VLOOKUP(A359,DICIEMBRE!B26:D56,3,FALSE)","v":"Festivo"}]
["2019-12-26",26,{"$f":"VLOOKUP(A360,DICIEMBRE!B27:D57,3,FALSE)","v":""}]
["2019-12-27",27,{"$f":"VLOOKUP(A361,DICIEMBRE!B28:D58,3,FALSE)","v":""}]
["2019-12-28",28,{"$f":"VLOOKUP(A362,DICIEMBRE!B29:D59,3,FALSE)","v":"Fin de semana"}]
["2019-12-29",29,{"$f":"VLOOKUP(A363,DICIEMBRE!B30:D60,3,FALSE)","v":"Fin de semana"}]
["2019-12-30",30,{"$f":"VLOOKUP(A364,DICIEMBRE!B31:D61,3,FALSE)","v":""}]
["2019-12-31",31,{"$f":"VLOOKUP(A365,DICIEMBRE!B32:D62,3,FALSE)","v":""}]

{"sheet":"ENERO","index":3,"n_rows":32,"n_cols":13,"rows_kept":32,"cut":false,"hidden":false,"merged":[]}
["SEMANA","Día","Día Semana","Tipo día","Entrada","Descanso","Salida","Total mañana","Entrada","Descanso","Salida","Total Tarde","Notas del día"]
[{"$f":"_xlfn.ISOWEEKNUM(B2)","v":1},"2019-01-01",{"$f":"WEEKDAY(B2,1)","v":"1900-01-03"},"Festivo",null,null,null,{"$f":"IF($G2-$E2=0,\"\",$G2-$E2-$F2)","v":""},null,null,null,{"$f":"IF(AND($D2<>\"Mañana y Tarde\",OR($I2<>\"\",$K2<>\"\")),\"El tipo de día debe ser Mañana y Tarde o no haber horas por la tarde\",IF($K2-$I2=0,\"\",$K2-$I2-$J2))","v":""}]
[{"$f":"_xlfn.ISOWEEKNUM(B3)","v":1},"2019-01-02",{"$f":"WEEKDAY(B3,1)","v":"1900-01-04"},{"$f":"IF(OR(C3=1,C3=7),\"Fin de semana\",\"\")","v":""},null,null,null,{"$f":"IF($G3-$E3=0,\"\",$G3-$E3-$F3)","v":""},null,null,null,{"$f":"IF(AND($D3<>\"Mañana y Tarde\",OR($I3<>\"\",$K3<>\"\")),\"El tipo de día debe ser Mañana y Tarde o no haber horas por la tarde\",IF($K3-$I3=0,\"\",$K3-$I3-$J3))","v":""}]
[1,"2019-01-03","1900-01-05","",null,null,null,"",null,null,null,""]
[1,"2019-01-04","1900-01-06","",null,null,null,"",null,null,null,""]
[1,"2019-01-05","1900-01-07",{"$f":"IF(OR(C6=1,C6=7),\"Fin de semana\",\"\")","v":"Fin de semana"},null,null,null,"",null,null,null,""]
[1,"2019-01-06","1900-01-01","Fin de semana",null,null,null,"",null,null,null,""]
[2,"2019-01-07","1900-01-02","",null,null,null,"",null,null,null,""]
[2,"2019-01-08","1900-01-03","",null,null,null,"",null,null,null,""]
[2,"2019-01-09","1900-01-04","",null,null,null,"",null,null,null,""]
[2,"2019-01-10","1900-01-05","",null,null,null,"",null,null,null,""]
[2,"2019-01-11","1900-01-06","",null,null,null,"",null,null,null,""]
[2,"2019-01-12","1900-01-07","Fin de semana",null,null,null,"",null,null,null,""]
[2,"2019-01-13","1900-01-01","Fin de semana",null,null,null,"",null,null,null,""]
[3,"2019-01-14","1900-01-02","",null,null,null,"",null,null,null,""]
[3,"2019-01-15","1900-01-03","",null,null,null,"",null,null,null,""]
[3,"2019-01-16","1900-01-04",{"$f":"IF(OR(C17=1,C17=7),\"Fin de semana\",\"\")","v":""},null,null,null,"",null,null,null,""]
[3,"2019-01-17","1900-01-05","",null,null,null,"",null,null,null,""]
[3,"2019-01-18","1900-01-06",{"$f":"IF(OR(C19=1,C19=7),\"Fin de semana\",\"\")","v":""},null,null,null,"",null,null,null,""]
[3,"2019-01-19","1900-01-07","Fin de semana",null,null,null,"",null,null,null,""]
[3,"2019-01-20","1900-01-01","Fin de semana",null,null,null,"",null,null,null,""]
[4,"2019-01-21","1900-01-02","",null,null,null,"",null,null,null,""]
[4,"2019-01-22","1900-01-03","",null,null,null,"",null,null,null,""]
[4,"2019-01-23","1900-01-04","",null,null,null,"",null,null,null,""]
[4,"2019-01-24","1900-01-05","",null,null,null,"",null,null,null,""]
[4,"2019-01-25","1900-01-06","",null,null,null,"",null,null,null,""]
[4,"2019-01-26","1900-01-07","Fin de semana",null,null,null,"",null,null,null,""]
[4,"2019-01-27","1900-01-01","Fin de semana",null,null,null,"",null,null,null,""]
[5,"2019-01-28","1900-01-02","",null,null,null,"",null,null,null,""]
[5,"2019-01-29","1900-01-03","",null,null,null,"",null,null,null,""]
[5,"2019-01-30","1900-01-04","",null,null,null,"",null,null,null,""]
[5,"2019-01-31","1900-01-05","",null,null,null,"",null,null,null,""]

{"sheet":"FEBRERO","index":4,"n_rows":29,"n_cols":13,"rows_kept":29,"cut":false,"hidden":false,"merged":[]}
["SEMANA","Día","Día Semana","Tipo día","Entrada","Descanso","Salida","Total mañana","Entrada","Descanso","Salida","Total Tarde","Notas del día"]
[{"$f":"_xlfn.ISOWEEKNUM(B2)","v":5},"2019-02-01",{"$f":"WEEKDAY(B2,1)","v":"1900-01-06"},{"$f":"IF(OR(C2=1,C2=7),\"Fin de semana\",\"\")","v":""},null,null,null,{"$f":"IF($G2-$E2=0,\"\",$G2-$E2-$F2)","v":""},null,null,null,{"$f":"IF(AND($D2<>\"Mañana y Tarde\",OR($I2<>\"\",$K2<>\"\")),\"El tipo de día debe ser Mañana y Tarde o no haber horas por la tarde\",IF($K2-$I2=0,\"\",$K2-$I2-$J2))","v":""}]
[{"$f":"_xlfn.ISOWEEKNUM(B3)","v":5},"2019-02-02",{"$f":"WEEKDAY(B3,1)","v":"1900-01-07"},{"$f":"IF(OR(C3=1,C3=7),\"Fin de semana\",\"\")","v":"Fin de semana"},null,null,null,{"$f":"IF($G3-$E3=0,\"\",$G3-$E3-$F3)","v":""},null,null,null,{"$f":"IF(AND($D3<>\"Mañana y Tarde\",OR($I3<>\"\",$K3<>\"\")),\"El tipo de día debe ser Mañana y Tarde o no haber horas por la tarde\",IF($K3-$I3=0,\"\",$K3-$I3-$J3))","v":""}]
[5,"2019-02-03","1900-01-01","Fin de semana",null,null,null,"",null,null,null,""]
[6,"2019-02-04","1900-01-02","",null,null,null,"",null,null,null,""]
[6,"2019-02-05","1900-01-03","",null,null,null,"",null,null,null,""]
[6,"2019-02-06","1900-01-04","",null,null,null,"",null,null,null,""]
[6,"2019-02-07","1900-01-05","",null,null,null,"",null,null,null,""]
[6,"2019-02-08","1900-01-06","",null,null,null,"",null,null,null,""]
[6,"2019-02-09","1900-01-07","Fin de semana",null,null,null,"",null,null,null,""]
[6,"2019-02-10","1900-01-01","Fin de semana",null,null,null,"",null,null,null,""]
[7,"2019-02-11","1900-01-02","",null,null,null,"",null,null,null,""]
[7,"2019-02-12","1900-01-03","",null,null,null,"",null,null,null,""]
[7,"2019-02-13","1900-01-04","",null,null,null,"",null,null,null,""]
[7,"2019-02-14","1900-01-05","",null,null,null,"",null,null,null,""]
[7,"2019-02-15","1900-01-06","",null,null,null,"",null,null,null,""]
[7,"2019-02-16","1900-01-07","Fin de semana",null,null,null,"",null,null,null,""]
[7,"2019-02-17","1900-01-01","Fin de semana",null,null,null,"",null,null,null,""]
[8,"2019-02-18","1900-01-02","",null,null,null,"",null,null,null,""]
[8,"2019-02-19","1900-01-03","",null,null,null,"",null,null,null,""]
[8,"2019-02-20","1900-01-04","",null,null,null,"",null,null,null,""]
[8,"2019-02-21","1900-01-05","",null,null,null,"",null,null,null,""]
[8,"2019-02-22","1900-01-06","",null,null,null,"",null,null,null,""]
[8,"2019-02-23","1900-01-07","Fin de semana",null,null,null,"",null,null,null,""]
[8,"2019-02-24","1900-01-01","Fin de semana",null,null,null,"",null,null,null,""]
[9,"2019-02-25","1900-01-02","",null,null,null,"",null,null,null,""]
[9,"2019-02-26","1900-01-03","",null,null,null,"",null,null,null,""]
[9,"2019-02-27","1900-01-04","",null,null,null,"",null,null,null,""]
[9,"2019-02-28","1900-01-05","",null,null,null,"",null,null,null,""]

{"sheet":"MARZO","index":5,"n_rows":32,"n_cols":13,"rows_kept":32,"cut":false,"hidden":false,"merged":[]}
["SEMANA","Día","Día Semana","Tipo día","Entrada","Descanso","Salida","Total mañana","Entrada","Descanso","Salida","Total Tarde","Notas del día"]
[{"$f":"_xlfn.ISOWEEKNUM(B2)","v":9},"2019-03-01",{"$f":"WEEKDAY(B2,1)","v":"1900-01-06"},{"$f":"IF(OR(C2=1,C2=7),\"Fin de semana\",\"\")","v":""},null,null,null,{"$f":"IF($G2-$E2=0,\"\",$G2-$E2-$F2)","v":""},null,null,null,{"$f":"IF(AND($D2<>\"Mañana y Tarde\",OR($I2<>\"\",$K2<>\"\")),\"El tipo de día debe ser Mañana y Tarde o no haber horas por la tarde\",IF($K2-$I2=0,\"\",$K2-$I2-$J2))","v":""}]
[{"$f":"_xlfn.ISOWEEKNUM(B3)","v":9},"2019-03-02",{"$f":"WEEKDAY(B3,1)","v":"1900-01-07"},{"$f":"IF(OR(C3=1,C3=7),\"Fin de semana\",\"\")","v":"Fin de semana"},null,null,null,{"$f":"IF($G3-$E3=0,\"\",$G3-$E3-$F3)","v":""},null,null,null,{"$f":"IF(AND($D3<>\"Mañana y Tarde\",OR($I3<>\"\",$K3<>\"\")),\"El tipo de día debe ser Mañana y Tarde o no haber horas por la tarde\",IF($K3-$I3=0,\"\",$K3-$I3-$J3))","v":""}]
[9,"2019-03-03","1900-01-01",{"$f":"IF(OR(C4=1,C4=7),\"Fin de semana\",\"\")","v":"Fin de semana"},null,null,null,"",null,null,null,""]
[10,"2019-03-04","1900-01-02","",null,null,null,"",null,null,null,""]
[10,"2019-03-05","1900-01-03","",null,null,null,"",null,null,null,""]
[10,"2019-03-06","1900-01-04","",null,null,null,"",null,null,null,""]
[10,"2019-03-07","1900-01-05","",null,null,null,"",null,null,null,""]
[10,"2019-03-08","1900-01-06","",null,null,null,"",null,null,null,""]
[10,"2019-03-09","1900-01-07","Fin de semana",null,null,null,"",null,null,null,""]
[10,"2019-03-10","1900-01-01","Fin de semana",null,null,null,"",null,null,null,""]
[11,"2019-03-11","1900-01-02","",null,null,null,"",null,null,null,""]
[11,"2019-03-12","1900-01-03","",null,null,null,"",null,null,null,""]
[11,"2019-03-13","1900-01-04","",null,null,null,"",null,null,null,""]
[11,"2019-03-14","1900-01-05","",null,null,null,"",null,null,null,""]
[11,"2019-03-15","1900-01-06","",null,null,null,"",null,null,null,""]
[11,"2019-03-16","1900-01-07","Fin de semana",null,null,null,"",null,null,null,""]
[11,"2019-03-17","1900-01-01","Fin de semana",null,null,null,"",null,null,null,""]
[12,"2019-03-18","1900-01-02","",null,null,null,"",null,null,null,""]
[12,"2019-03-19","1900-01-03","",null,null,null,"",null,null,null,""]
[12,"2019-03-20","1900-01-04","",null,null,null,"",null,null,null,""]
[12,"2019-03-21","1900-01-05","",null,null,null,"",null,null,null,""]
[12,"2019-03-22","1900-01-06","",null,null,null,"",null,null,null,""]
[12,"2019-03-23","1900-01-07","Fin de semana",null,null,null,"",null,null,null,""]
[12,"2019-03-24","1900-01-01","Fin de semana",null,null,null,"",null,null,null,""]
[13,"2019-03-25","1900-01-02","",null,null,null,"",null,null,null,""]
[13,"2019-03-26","1900-01-03","",null,null,null,"",null,null,null,""]
[13,"2019-03-27","1900-01-04","",null,null,null,"",null,null,null,""]
[13,"2019-03-28","1900-01-05","",null,null,null,"",null,null,null,""]
[13,"2019-03-29","1900-01-06","",null,null,null,"",null,null,null,""]
[13,"2019-03-30","1900-01-07","Fin de semana",null,null,null,"",null,null,null,""]
[13,"2019-03-31","1900-01-01","Fin de semana",null,null,null,"",null,null,null,""]

{"sheet":"ABRIL","index":6,"n_rows":31,"n_cols":13,"rows_kept":31,"cut":false,"hidden":false,"merged":[]}
["SEMANA","Día","Día Semana","Tipo día","Entrada","Descanso","Salida","Total mañana","Entrada","Descanso","Salida","Total Tarde","Notas del día"]
[{"$f":"_xlfn.ISOWEEKNUM(B2)","v":14},"2019-04-01",{"$f":"WEEKDAY(B2,1)","v":"1900-01-02"},{"$f":"IF(OR(C2=1,C2=7),\"Fin de semana\",\"\")","v":""},null,null,null,{"$f":"IF($G2-$E2=0,\"\",$G2-$E2-$F2)","v":""},null,null,null,{"$f":"IF(AND($D2<>\"Mañana y Tarde\",OR($I2<>\"\",$K2<>\"\")),\"El tipo de día debe ser Mañana y Tarde o no haber horas por la tarde\",IF($K2-$I2=0,\"\",$K2-$I2-$J2))","v":""}]
[{"$f":"_xlfn.ISOWEEKNUM(B3)","v":14},"2019-04-02",{"$f":"WEEKDAY(B3,1)","v":"1900-01-03"},{"$f":"IF(OR(C3=1,C3=7),\"Fin de semana\",\"\")","v":""},null,null,null,{"$f":"IF($G3-$E3=0,\"\",$G3-$E3-$F3)","v":""},null,null,null,{"$f":"IF(AND($D3<>\"Mañana y Tarde\",OR($I3<>\"\",$K3<>\"\")),\"El tipo de día debe ser Mañana y Tarde o no haber horas por la tarde\",IF($K3-$I3=0,\"\",$K3-$I3-$J3))","v":""}]
[14,"2019-04-03","1900-01-04",{"$f":"IF(OR(C4=1,C4=7),\"Fin de semana\",\"\")","v":""},null,null,null,"",null,null,null,""]
[14,"2019-04-04","1900-01-05","",null,null,null,"",null,null,null,""]
[14,"2019-04-05","1900-01-06","",null,null,null,"",null,null,null,""]
[14,"2019-04-06","1900-01-07","Fin de semana",null,null,null,"",null,null,null,""]
[14,"2019-04-07","1900-01-01","Fin de semana",null,null,null,"",null,null,null,""]
[15,"2019-04-08","1900-01-02","",null,null,null,"",null,null,null,""]
[15,"2019-04-09","1900-01-03","",null,null,null,"",null,null,null,""]
[15,"2019-04-10","1900-01-04","",null,null,null,"",null,null,null,""]
[15,"2019-04-11","1900-01-05","",null,null,null,"",null,null,null,""]
[15,"2019-04-12","1900-01-06","",null,null,null,"",null,null,null,""]
[15,"2019-04-13","1900-01-07","Fin de semana",null,null,null,"",null,null,null,""]
[15,"2019-04-14","1900-01-01","Fin de semana",null,null,null,"",null,null,null,""]
[16,"2019-04-15","1900-01-02","",null,null,null,"",null,null,null,""]
[16,"2019-04-16","1900-01-03","",null,null,null,"",null,null,null,""]
[16,"2019-04-17","1900-01-04","",null,null,null,"",null,null,null,""]
[16,"2019-04-18","1900-01-05","",null,null,null,"",null,null,null,""]
[16,"2019-04-19","1900-01-06","",null,null,null,"",null,null,null,""]
[16,"2019-04-20","1900-01-07","Fin de semana",null,null,null,"",null,null,null,""]
[16,"2019-04-21","1900-01-01","Fin de semana",null,null,null,"",null,null,null,""]
[17,"2019-04-22","1900-01-02","",null,null,null,"",null,null,null,""]
[17,"2019-04-23","1900-01-03","",null,null,null,"",null,null,null,""]
[17,"2019-04-24","1900-01-04","",null,null,null,"",null,null,null,""]
[17,"2019-04-25","1900-01-05","",null,null,null,"",null,null,null,""]
[17,"2019-04-26","1900-01-06","",null,null,null,"",null,null,null,""]
[17,"2019-04-27","1900-01-07","Fin de semana",null,null,null,"",null,null,null,""]
[17,"2019-04-28","1900-01-01","Fin de semana",null,null,null,"",null,null,null,""]
[18,"2019-04-29","1900-01-02","",null,null,null,"",null,null,null,""]
[18,"2019-04-30","1900-01-03","",null,null,null,"",null,null,null,""]

{"sheet":"MAYO","index":7,"n_rows":32,"n_cols":13,"rows_kept":32,"cut":false,"hidden":false,"merged":[]}
["SEMANA","Día","Día Semana","Tipo día","Entrada","Descanso","Salida","Total mañana","Entrada","Descanso","Salida","Total Tarde","Notas del día"]
[{"$f":"_xlfn.ISOWEEKNUM(B2)","v":18},"2019-05-01",{"$f":"WEEKDAY(B2,1)","v":"1900-01-04"},"Festivo",null,null,null,{"$f":"IF($G2-$E2=0,\"\",$G2-$E2-$F2)","v":""},null,null,null,{"$f":"IF(AND($D2<>\"Mañana y Tarde\",OR($I2<>\"\",$K2<>\"\")),\"El tipo de día debe ser Mañana y Tarde o no haber horas por la tarde\",IF($K2-$I2=0,\"\",$K2-$I2-$J2))","v":""}]
[{"$f":"_xlfn.ISOWEEKNUM(B3)","v":18},"2019-05-02",{"$f":"WEEKDAY(B3,1)","v":"1900-01-05"},{"$f":"IF(OR(C3=1,C3=7),\"Fin de semana\",\"\")","v":""},null,null,null,{"$f":"IF($G3-$E3=0,\"\",$G3-$E3-$F3)","v":""},null,null,null,{"$f":"IF(AND($D3<>\"Mañana y Tarde\",OR($I3<>\"\",$K3<>\"\")),\"El tipo de día debe ser Mañana y Tarde o no haber horas por la tarde\",IF($K3-$I3=0,\"\",$K3-$I3-$J3))","v":""}]
[18,"2019-05-03","1900-01-06",{"$f":"IF(OR(C4=1,C4=7),\"Fin de semana\",\"\")","v":""},null,null,null,"",null,null,null,""]
[18,"2019-05-04","1900-01-07","Fin de semana",null,null,null,"",null,null,null,""]
[18,"2019-05-05","1900-01-01","Fin de semana",null,null,null,"",null,null,null,""]
[19,"2019-05-06","1900-01-02","",null,null,null,"",null,null,null,""]
[19,"2019-05-07","1900-01-03","",null,null,null,"",null,null,null,""]
[19,"2019-05-08","1900-01-04","",null,null,null,"",null,null,null,""]
[19,"2019-05-09","1900-01-05","",null,null,null,"",null,null,null,""]
[19,"2019-05-10","1900-01-06","",null,null,null,"",null,null,null,""]
[19,"2019-05-11","1900-01-07","Fin de semana",null,null,null,"",null,null,null,""]
[19,"2019-05-12","1900-01-01","Fin de semana",null,null,null,"",null,null,null,""]
[20,"2019-05-13","1900-01-02","",null,null,null,"",null,null,null,""]
[20,"2019-05-14","1900-01-03","",null,null,null,"",null,null,null,""]
[20,"2019-05-15","1900-01-04","",null,null,null,"",null,null,null,""]
[20,"2019-05-16","1900-01-05","",null,null,null,"",null,null,null,""]
[20,"2019-05-17","1900-01-06","",null,null,null,"",null,null,null,""]
[20,"2019-05-18","1900-01-07","Fin de semana",null,null,null,"",null,null,null,""]
[20,"2019-05-19","1900-01-01","Fin de semana",null,null,null,"",null,null,null,""]
[21,"2019-05-20","1900-01-02","",null,null,null,"",null,null,null,""]
[21,"2019-05-21","1900-01-03","",null,null,null,"",null,null,null,""]
[21,"2019-05-22","1900-01-04","",null,null,null,"",null,null,null,""]
[21,"2019-05-23","1900-01-05","",null,null,null,"",null,null,null,""]
[21,"2019-05-24","1900-01-06","",null,null,null,"",null,null,null,""]
[21,"2019-05-25","1900-01-07","Fin de semana",null,null,null,"",null,null,null,""]
[21,"2019-05-26","1900-01-01","Fin de semana",null,null,null,"",null,null,null,""]
[22,"2019-05-27","1900-01-02","",null,null,null,"",null,null,null,""]
[22,"2019-05-28","1900-01-03","",null,null,null,"",null,null,null,""]
[22,"2019-05-29","1900-01-04","",null,null,null,"",null,null,null,""]
[22,"2019-05-30","1900-01-05","",null,null,null,"",null,null,null,""]
[22,"2019-05-31","1900-01-06","",null,null,null,"",null,null,null,""]

{"sheet":"JUNIO","index":8,"n_rows":31,"n_cols":13,"rows_kept":31,"cut":false,"hidden":false,"merged":[]}
["SEMANA","Día","Día Semana","Tipo día","Entrada","Descanso","Salida","Total mañana","Entrada","Descanso","Salida","Total Tarde","Notas del día"]
[{"$f":"_xlfn.ISOWEEKNUM(B2)","v":22},"2019-06-01",{"$f":"WEEKDAY(B2,1)","v":"1900-01-07"},{"$f":"IF(OR(C2=1,C2=7),\"Fin de semana\",\"\")","v":"Fin de semana"},null,null,null,{"$f":"IF($G2-$E2=0,\"\",$G2-$E2-$F2)","v":""},null,null,null,{"$f":"IF(AND($D2<>\"Mañana y Tarde\",OR($I2<>\"\",$K2<>\"\")),\"El tipo de día debe ser Mañana y Tarde o no haber horas por la tarde\",IF($K2-$I2=0,\"\",$K2-$I2-$J2))","v":""}]
[{"$f":"_xlfn.ISOWEEKNUM(B3)","v":22},"2019-06-02",{"$f":"WEEKDAY(B3,1)","v":"1900-01-01"},{"$f":"IF(OR(C3=1,C3=7),\"Fin de semana\",\"\")","v":"Fin de semana"},null,null,null,{"$f":"IF($G3-$E3=0,\"\",$G3-$E3-$F3)","v":""},null,null,null,{"$f":"IF(AND($D3<>\"Mañana y Tarde\",OR($I3<>\"\",$K3<>\"\")),\"El tipo de día debe ser Mañana y Tarde o no haber horas por la tarde\",IF($K3-$I3=0,\"\",$K3-$I3-$J3))","v":""}]
[23,"2019-06-03","1900-01-02",{"$f":"IF(OR(C4=1,C4=7),\"Fin de semana\",\"\")","v":""},null,null,null,"",null,null,null,""]
[23,"2019-06-04","1900-01-03","",null,null,null,"",null,null,null,""]
[23,"2019-06-05","1900-01-04","",null,null,null,"",null,null,null,""]
[23,"2019-06-06","1900-01-05","",null,null,null,"",null,null,null,""]
[23,"2019-06-07","1900-01-06","",null,null,null,"",null,null,null,""]
[23,"2019-06-08","1900-01-07","Fin de semana",null,null,null,"",null,null,null,""]
[23,"2019-06-09","1900-01-01","Fin de semana",null,null,null,"",null,null,null,""]
[24,"2019-06-10","1900-01-02","",null,null,null,"",null,null,null,""]
[24,"2019-06-11","1900-01-03","",null,null,null,"",null,null,null,""]
[24,"2019-06-12","1900-01-04","",null,null,null,"",null,null,null,""]
[24,"2019-06-13","1900-01-05","",null,null,null,"",null,null,null,""]
[24,"2019-06-14","1900-01-06","",null,null,null,"",null,null,null,""]
[24,"2019-06-15","1900-01-07","Fin de semana",null,null,null,"",null,null,null,""]
[24,"2019-06-16","1900-01-01","Fin de semana",null,null,null,"",null,null,null,""]
[25,"2019-06-17","1900-01-02","",null,null,null,"",null,null,null,""]
[25,"2019-06-18","1900-01-03","",null,null,null,"",null,null,null,""]
[25,"2019-06-19","1900-01-04","",null,null,null,"",null,null,null,""]
[25,"2019-06-20","1900-01-05","",null,null,null,"",null,null,null,""]
[25,"2019-06-21","1900-01-06","",null,null,null,"",null,null,null,""]
[25,"2019-06-22","1900-01-07","Fin de semana",null,null,null,"",null,null,null,""]
[25,"2019-06-23","1900-01-01","Fin de semana",null,null,null,"",null,null,null,""]
[26,"2019-06-24","1900-01-02","",null,null,null,"",null,null,null,""]
[26,"2019-06-25","1900-01-03","",null,null,null,"",null,null,null,""]
[26,"2019-06-26","1900-01-04","",null,null,null,"",null,null,null,""]
[26,"2019-06-27","1900-01-05","",null,null,null,"",null,null,null,""]
[26,"2019-06-28","1900-01-06","",null,null,null,"",null,null,null,""]
[26,"2019-06-29","1900-01-07","Fin de semana",null,null,null,"",null,null,null,""]
[26,"2019-06-30","1900-01-01","Fin de semana",null,null,null,"",null,null,null,""]

{"sheet":"JULIO","index":9,"n_rows":32,"n_cols":13,"rows_kept":32,"cut":false,"hidden":false,"merged":[]}
["SEMANA","Día","Día Semana","Tipo día","Entrada","Descanso","Salida","Total mañana","Entrada","Descanso","Salida","Total Tarde","Notas del día"]
[{"$f":"_xlfn.ISOWEEKNUM(B2)","v":27},"2019-07-01",{"$f":"WEEKDAY(B2,1)","v":"1900-01-02"},{"$f":"IF(OR(C2=1,C2=7),\"Fin de semana\",\"\")","v":""},null,null,null,{"$f":"IF($G2-$E2=0,\"\",$G2-$E2-$F2)","v":""},null,null,null,{"$f":"IF(AND($D2<>\"Mañana y Tarde\",OR($I2<>\"\",$K2<>\"\")),\"El tipo de día debe ser Mañana y Tarde o no haber horas por la tarde\",IF($K2-$I2=0,\"\",$K2-$I2-$J2))","v":""}]
[{"$f":"_xlfn.ISOWEEKNUM(B3)","v":27},"2019-07-02",{"$f":"WEEKDAY(B3,1)","v":"1900-01-03"},{"$f":"IF(OR(C3=1,C3=7),\"Fin de semana\",\"\")","v":""},null,null,null,{"$f":"IF($G3-$E3=0,\"\",$G3-$E3-$F3)","v":""},null,null,null,{"$f":"IF(AND($D3<>\"Mañana y Tarde\",OR($I3<>\"\",$K3<>\"\")),\"El tipo de día debe ser Mañana y Tarde o no haber horas por la tarde\",IF($K3-$I3=0,\"\",$K3-$I3-$J3))","v":""}]
[27,"2019-07-03","1900-01-04",{"$f":"IF(OR(C4=1,C4=7),\"Fin de semana\",\"\")","v":""},null,null,null,"",null,null,null,""]
[27,"2019-07-04","1900-01-05","",null,null,null,"",null,null,null,""]
[27,"2019-07-05","1900-01-06","",null,null,null,"",null,null,null,""]
[27,"2019-07-06","1900-01-07","Fin de semana",null,null,null,"",null,null,null,""]
[27,"2019-07-07","1900-01-01","Fin de semana",null,null,null,"",null,null,null,""]
[28,"2019-07-08","1900-01-02","",null,null,null,"",null,null,null,""]
[28,"2019-07-09","1900-01-03","",null,null,null,"",null,null,null,""]
[28,"2019-07-10","1900-01-04","",null,null,null,"",null,null,null,""]
[28,"2019-07-11","1900-01-05","",null,null,null,"",null,null,null,""]
[28,"2019-07-12","1900-01-06","",null,null,null,"",null,null,null,""]
[28,"2019-07-13","1900-01-07","Fin de semana",null,null,null,"",null,null,null,""]
[28,"2019-07-14","1900-01-01","Fin de semana",null,null,null,"",null,null,null,""]
[29,"2019-07-15","1900-01-02","",null,null,null,"",null,null,null,""]
[29,"2019-07-16","1900-01-03","",null,null,null,"",null,null,null,""]
[29,"2019-07-17","1900-01-04","",null,null,null,"",null,null,null,""]
[29,"2019-07-18","1900-01-05","",null,null,null,"",null,null,null,""]
[29,"2019-07-19","1900-01-06","",null,null,null,"",null,null,null,""]
[29,"2019-07-20","1900-01-07","Fin de semana",null,null,null,"",null,null,null,""]
[29,"2019-07-21","1900-01-01","Fin de semana",null,null,null,"",null,null,null,""]
[30,"2019-07-22","1900-01-02","",null,null,null,"",null,null,null,""]
[30,"2019-07-23","1900-01-03","",null,null,null,"",null,null,null,""]
[30,"2019-07-24","1900-01-04","",null,null,null,"",null,null,null,""]
[30,"2019-07-25","1900-01-05","",null,null,null,"",null,null,null,""]
[30,"2019-07-26","1900-01-06","",null,null,null,"",null,null,null,""]
[30,"2019-07-27","1900-01-07","Fin de semana",null,null,null,"",null,null,null,""]
[30,"2019-07-28","1900-01-01","Fin de semana",null,null,null,"",null,null,null,""]
[31,"2019-07-29","1900-01-02","",null,null,null,"",null,null,null,""]
[31,"2019-07-30","1900-01-03","",null,null,null,"",null,null,null,""]
[31,"2019-07-31","1900-01-04","",null,null,null,"",null,null,null,""]

{"sheet":"AGOSTO","index":10,"n_rows":32,"n_cols":13,"rows_kept":32,"cut":false,"hidden":false,"merged":[]}
["SEMANA","Día","Día Semana","Tipo día","Entrada","Descanso","Salida","Total mañana","Entrada","Descanso","Salida","Total Tarde","Notas del día"]
[{"$f":"_xlfn.ISOWEEKNUM(B2)","v":31},"2019-08-01",{"$f":"WEEKDAY(B2,1)","v":"1900-01-05"},{"$f":"IF(OR(C2=1,C2=7),\"Fin de semana\",\"\")","v":""},null,null,null,{"$f":"IF($G2-$E2=0,\"\",$G2-$E2-$F2)","v":""},null,null,null,{"$f":"IF(AND($D2<>\"Mañana y Tarde\",OR($I2<>\"\",$K2<>\"\")),\"El tipo de día debe ser Mañana y Tarde o no haber horas por la tarde\",IF($K2-$I2=0,\"\",$K2-$I2-$J2))","v":""}]
[{"$f":"_xlfn.ISOWEEKNUM(B3)","v":31},"2019-08-02",{"$f":"WEEKDAY(B3,1)","v":"1900-01-06"},{"$f":"IF(OR(C3=1,C3=7),\"Fin de semana\",\"\")","v":""},null,null,null,{"$f":"IF($G3-$E3=0,\"\",$G3-$E3-$F3)","v":""},null,null,null,{"$f":"IF(AND($D3<>\"Mañana y Tarde\",OR($I3<>\"\",$K3<>\"\")),\"El tipo de día debe ser Mañana y Tarde o no haber horas por la tarde\",IF($K3-$I3=0,\"\",$K3-$I3-$J3))","v":""}]
[31,"2019-08-03","1900-01-07",{"$f":"IF(OR(C4=1,C4=7),\"Fin de semana\",\"\")","v":"Fin de semana"},null,null,null,"",null,null,null,""]
[31,"2019-08-04","1900-01-01","Fin de semana",null,null,null,"",null,null,null,""]
[32,"2019-08-05","1900-01-02","",null,null,null,"",null,null,null,""]
[32,"2019-08-06","1900-01-03","",null,null,null,"",null,null,null,""]
[32,"2019-08-07","1900-01-04","",null,null,null,"",null,null,null,""]
[32,"2019-08-08","1900-01-05","",null,null,null,"",null,null,null,""]
[32,"2019-08-09","1900-01-06","",null,null,null,"",null,null,null,""]
[32,"2019-08-10","1900-01-07","Fin de semana",null,null,null,"",null,null,null,""]
[32,"2019-08-11","1900-01-01","Fin de semana",null,null,null,"",null,null,null,""]
[33,"2019-08-12","1900-01-02","",null,null,null,"",null,null,null,""]
[33,"2019-08-13","1900-01-03","",null,null,null,"",null,null,null,""]
[33,"2019-08-14","1900-01-04","",null,null,null,"",null,null,null,""]
[33,"2019-08-15","1900-01-05","Festivo",null,null,null,"",null,null,null,""]
[33,"2019-08-16","1900-01-06","",null,null,null,"",null,null,null,""]
[33,"2019-08-17","1900-01-07","Fin de semana",null,null,null,"",null,null,null,""]
[33,"2019-08-18","1900-01-01","Fin de semana",null,null,null,"",null,null,null,""]
[34,"2019-08-19","1900-01-02","",null,null,null,"",null,null,null,""]
[34,"2019-08-20","1900-01-03","",null,null,null,"",null,null,null,""]
[34,"2019-08-21","1900-01-04","",null,null,null,"",null,null,null,""]
[34,"2019-08-22","1900-01-05","",null,null,null,"",null,null,null,""]
[34,"2019-08-23","1900-01-06","",null,null,null,"",null,null,null,""]
[34,"2019-08-24","1900-01-07","Fin de semana",null,null,null,"",null,null,null,""]
[34,"2019-08-25","1900-01-01","Fin de semana",null,null,null,"",null,null,null,""]
[35,"2019-08-26","1900-01-02","",null,null,null,"",null,null,null,""]
[35,"2019-08-27","1900-01-03","",null,null,null,"",null,null,null,""]
[35,"2019-08-28","1900-01-04","",null,null,null,"",null,null,null,""]
[35,"2019-08-29","1900-01-05","",null,null,null,"",null,null,null,""]
[35,"2019-08-30","1900-01-06","",null,null,null,"",null,null,null,""]
[35,"2019-08-31","1900-01-07","Fin de semana",null,null,null,"",null,null,null,""]

{"sheet":"SEPTIEMBRE","index":11,"n_rows":31,"n_cols":13,"rows_kept":31,"cut":false,"hidden":false,"merged":[]}
["SEMANA","Día","Día Semana","Tipo día","Entrada","Descanso","Salida","Total mañana","Entrada","Descanso","Salida","Total Tarde","Notas del día"]
[{"$f":"_xlfn.ISOWEEKNUM(B2)","v":35},"2019-09-01",{"$f":"WEEKDAY(B2,1)","v":"1900-01-01"},{"$f":"IF(OR(C2=1,C2=7),\"Fin de semana\",\"\")","v":"Fin de semana"},null,null,null,{"$f":"IF($G2-$E2=0,\"\",$G2-$E2-$F2)","v":""},null,null,null,{"$f":"IF(AND($D2<>\"Mañana y Tarde\",OR($I2<>\"\",$K2<>\"\")),\"El tipo de día debe ser Mañana y Tarde o no haber horas por la tarde\",IF($K2-$I2=0,\"\",$K2-$I2-$J2))","v":""}]
[{"$f":"_xlfn.ISOWEEKNUM(B3)","v":36},"2019-09-02",{"$f":"WEEKDAY(B3,1)","v":"1900-01-02"},{"$f":"IF(OR(C3=1,C3=7),\"Fin de semana\",\"\")","v":""},null,null,null,{"$f":"IF($G3-$E3=0,\"\",$G3-$E3-$F3)","v":""},null,null,null,{"$f":"IF(AND($D3<>\"Mañana y Tarde\",OR($I3<>\"\",$K3<>\"\")),\"El tipo de día debe ser Mañana y Tarde o no haber horas por la tarde\",IF($K3-$I3=0,\"\",$K3-$I3-$J3))","v":""}]
[36,"2019-09-03","1900-01-03",{"$f":"IF(OR(C4=1,C4=7),\"Fin de semana\",\"\")","v":""},null,null,null,"",null,null,null,""]
[36,"2019-09-04","1900-01-04","",null,null,null,"",null,null,null,""]
[36,"2019-09-05","1900-01-05","",null,null,null,"",null,null,null,""]
[36,"2019-09-06","1900-01-06","",null,null,null,"",null,null,null,""]
[36,"2019-09-07","1900-01-07","Fin de semana",null,null,null,"",null,null,null,""]
[36,"2019-09-08","1900-01-01","Fin de semana",null,null,null,"",null,null,null,""]
[37,"2019-09-09","1900-01-02","",null,null,null,"",null,null,null,""]
[37,"2019-09-10","1900-01-03","",null,null,null,"",null,null,null,""]
[37,"2019-09-11","1900-01-04","",null,null,null,"",null,null,null,""]
[37,"2019-09-12","1900-01-05","",null,null,null,"",null,null,null,""]
[37,"2019-09-13","1900-01-06","",null,null,null,"",null,null,null,""]
[37,"2019-09-14","1900-01-07","Fin de semana",null,null,null,"",null,null,null,""]
[37,"2019-09-15","1900-01-01","Fin de semana",null,null,null,"",null,null,null,""]
[38,"2019-09-16","1900-01-02","",null,null,null,"",null,null,null,""]
[38,"2019-09-17","1900-01-03","",null,null,null,"",null,null,null,""]
[38,"2019-09-18","1900-01-04","",null,null,null,"",null,null,null,""]
[38,"2019-09-19","1900-01-05","",null,null,null,"",null,null,null,""]
[38,"2019-09-20","1900-01-06","",null,null,null,"",null,null,null,""]
[38,"2019-09-21","1900-01-07","Fin de semana",null,null,null,"",null,null,null,""]
[38,"2019-09-22","1900-01-01","Fin de semana",null,null,null,"",null,null,null,""]
[39,"2019-09-23","1900-01-02","",null,null,null,"",null,null,null,""]
[39,"2019-09-24","1900-01-03","",null,null,null,"",null,null,null,""]
[39,"2019-09-25","1900-01-04","",null,null,null,"",null,null,null,""]
[39,"2019-09-26","1900-01-05","",null,null,null,"",null,null,null,""]
[39,"2019-09-27","1900-01-06","",null,null,null,"",null,null,null,""]
[39,"2019-09-28","1900-01-07","Fin de semana",null,null,null,"",null,null,null,""]
[39,"2019-09-29","1900-01-01","Fin de semana",null,null,null,"",null,null,null,""]
[40,"2019-09-30","1900-01-02","",null,null,null,"",null,null,null,""]

{"sheet":"OCTUBRE","index":12,"n_rows":32,"n_cols":13,"rows_kept":32,"cut":false,"hidden":false,"merged":[]}
["SEMANA","Día","Día Semana","Tipo día","Entrada","Descanso","Salida","Total mañana","Entrada","Descanso","Salida","Total Tarde","Notas del día"]
[{"$f":"_xlfn.ISOWEEKNUM(B2)","v":40},"2019-10-01",{"$f":"WEEKDAY(B2,1)","v":"1900-01-03"},{"$f":"IF(OR(C2=1,C2=7),\"Fin de semana\",\"\")","v":""},null,null,null,{"$f":"IF($G2-$E2=0,\"\",$G2-$E2-$F2)","v":""},null,null,null,{"$f":"IF(AND($D2<>\"Mañana y Tarde\",OR($I2<>\"\",$K2<>\"\")),\"El tipo de día debe ser Mañana y Tarde o no haber horas por la tarde\",IF($K2-$I2=0,\"\",$K2-$I2-$J2))","v":""}]
[{"$f":"_xlfn.ISOWEEKNUM(B3)","v":40},"2019-10-02",{"$f":"WEEKDAY(B3,1)","v":"1900-01-04"},{"$f":"IF(OR(C3=1,C3=7),\"Fin de semana\",\"\")","v":""},null,null,null,{"$f":"IF($G3-$E3=0,\"\",$G3-$E3-$F3)","v":""},null,null,null,{"$f":"IF(AND($D3<>\"Mañana y Tarde\",OR($I3<>\"\",$K3<>\"\")),\"El tipo de día debe ser Mañana y Tarde o no haber horas por la tarde\",IF($K3-$I3=0,\"\",$K3-$I3-$J3))","v":""}]
[40,"2019-10-03","1900-01-05",{"$f":"IF(OR(C4=1,C4=7),\"Fin de semana\",\"\")","v":""},null,null,null,"",null,null,null,""]
[40,"2019-10-04","1900-01-06","",null,null,null,"",null,null,null,""]
[40,"2019-10-05","1900-01-07","Fin de semana",null,null,null,"",null,null,null,""]
[40,"2019-10-06","1900-01-01","Fin de semana",null,null,null,"",null,null,null,""]
[41,"2019-10-07","1900-01-02","",null,null,null,"",null,null,null,""]
[41,"2019-10-08","1900-01-03","",null,null,null,"",null,null,null,""]
[41,"2019-10-09","1900-01-04","",null,null,null,"",null,null,null,""]
[41,"2019-10-10","1900-01-05","",null,null,null,"",null,null,null,""]
[41,"2019-10-11","1900-01-06","",null,null,null,"",null,null,null,""]
[41,"2019-10-12","1900-01-07","Festivo",null,null,null,"",null,null,null,""]
[41,"2019-10-13","1900-01-01","Fin de semana",null,null,null,"",null,null,null,""]
[42,"2019-10-14","1900-01-02","",null,null,null,"",null,null,null,""]
[42,"2019-10-15","1900-01-03","",null,null,null,"",null,null,null,""]
[42,"2019-10-16","1900-01-04","",null,null,null,"",null,null,null,""]
[42,"2019-10-17","1900-01-05","",null,null,null,"",null,null,null,""]
[42,"2019-10-18","1900-01-06","",null,null,null,"",null,null,null,""]
[42,"2019-10-19","1900-01-07","Fin de semana",null,null,null,"",null,null,null,""]
[42,"2019-10-20","1900-01-01","Fin de semana",null,null,null,"",null,null,null,""]
[43,"2019-10-21","1900-01-02","",null,null,null,"",null,null,null,""]
[43,"2019-10-22","1900-01-03","",null,null,null,"",null,null,null,""]
[43,"2019-10-23","1900-01-04","",null,null,null,"",null,null,null,""]
[43,"2019-10-24","1900-01-05","",null,null,null,"",null,null,null,""]
[43,"2019-10-25","1900-01-06","",null,null,null,"",null,null,null,""]
[43,"2019-10-26","1900-01-07","Fin de semana",null,null,null,"",null,null,null,""]
[43,"2019-10-27","1900-01-01","Fin de semana",null,null,null,"",null,null,null,""]
[44,"2019-10-28","1900-01-02","",null,null,null,"",null,null,null,""]
[44,"2019-10-29","1900-01-03","",null,null,null,"",null,null,null,""]
[44,"2019-10-30","1900-01-04","",null,null,null,"",null,null,null,""]
[44,"2019-10-31","1900-01-05","",null,null,null,"",null,null,null,""]

{"sheet":"NOVIEMBRE","index":13,"n_rows":31,"n_cols":13,"rows_kept":31,"cut":false,"hidden":false,"merged":[]}
["SEMANA","Día","Día Semana","Tipo día","Entrada","Descanso","Salida","Total mañana","Entrada","Descanso","Salida","Total Tarde","Notas del día"]
[{"$f":"_xlfn.ISOWEEKNUM(B2)","v":44},"2019-11-01",{"$f":"WEEKDAY(B2,1)","v":"1900-01-06"},"Festivo",null,null,null,{"$f":"IF($G2-$E2=0,\"\",$G2-$E2-$F2)","v":""},null,null,null,{"$f":"IF(AND($D2<>\"Mañana y Tarde\",OR($I2<>\"\",$K2<>\"\")),\"El tipo de día debe ser Mañana y Tarde o no haber horas por la tarde\",IF($K2-$I2=0,\"\",$K2-$I2-$J2))","v":""}]
[{"$f":"_xlfn.ISOWEEKNUM(B3)","v":44},"2019-11-02",{"$f":"WEEKDAY(B3,1)","v":"1900-01-07"},{"$f":"IF(OR(C3=1,C3=7),\"Fin de semana\",\"\")","v":"Fin de semana"},null,null,null,{"$f":"IF($G3-$E3=0,\"\",$G3-$E3-$F3)","v":""},null,null,null,{"$f":"IF(AND($D3<>\"Mañana y Tarde\",OR($I3<>\"\",$K3<>\"\")),\"El tipo de día debe ser Mañana y Tarde o no haber horas por la tarde\",IF($K3-$I3=0,\"\",$K3-$I3-$J3))","v":""}]
[44,"2019-11-03","1900-01-01",{"$f":"IF(OR(C4=1,C4=7),\"Fin de semana\",\"\")","v":"Fin de semana"},null,null,null,"",null,null,null,""]
[45,"2019-11-04","1900-01-02","",null,null,null,"",null,null,null,""]
[45,"2019-11-05","1900-01-03","",null,null,null,"",null,null,null,""]
[45,"2019-11-06","1900-01-04","",null,null,null,"",null,null,null,""]
[45,"2019-11-07","1900-01-05","",null,null,null,"",null,null,null,""]
[45,"2019-11-08","1900-01-06","",null,null,null,"",null,null,null,""]
[45,"2019-11-09","1900-01-07","Fin de semana",null,null,null,"",null,null,null,""]
[45,"2019-11-10","1900-01-01","Fin de semana",null,null,null,"",null,null,null,""]
[46,"2019-11-11","1900-01-02","",null,null,null,"",null,null,null,""]
[46,"2019-11-12","1900-01-03","",null,null,null,"",null,null,null,""]
[46,"2019-11-13","1900-01-04","",null,null,null,"",null,null,null,""]
[46,"2019-11-14","1900-01-05","",null,null,null,"",null,null,null,""]
[46,"2019-11-15","1900-01-06","",null,null,null,"",null,null,null,""]
[46,"2019-11-16","1900-01-07","Fin de semana",null,null,null,"",null,null,null,""]
[46,"2019-11-17","1900-01-01","Fin de semana",null,null,null,"",null,null,null,""]
[47,"2019-11-18","1900-01-02","",null,null,null,"",null,null,null,""]
[47,"2019-11-19","1900-01-03","",null,null,null,"",null,null,null,""]
[47,"2019-11-20","1900-01-04","",null,null,null,"",null,null,null,""]
[47,"2019-11-21","1900-01-05","",null,null,null,"",null,null,null,""]
[47,"2019-11-22","1900-01-06","",null,null,null,"",null,null,null,""]
[47,"2019-11-23","1900-01-07","Fin de semana",null,null,null,"",null,null,null,""]
[47,"2019-11-24","1900-01-01","Fin de semana",null,null,null,"",null,null,null,""]
[48,"2019-11-25","1900-01-02","",null,null,null,"",null,null,null,""]
[48,"2019-11-26","1900-01-03","",null,null,null,"",null,null,null,""]
[48,"2019-11-27","1900-01-04","",null,null,null,"",null,null,null,""]
[48,"2019-11-28","1900-01-05","",null,null,null,"",null,null,null,""]
[48,"2019-11-29","1900-01-06","",null,null,null,"",null,null,null,""]
[48,"2019-11-30","1900-01-07","Fin de semana",null,null,null,"",null,null,null,""]

{"sheet":"DICIEMBRE","index":14,"n_rows":32,"n_cols":13,"rows_kept":32,"cut":false,"hidden":false,"merged":[]}
["SEMANA","Día","Día Semana","Tipo día","Entrada","Descanso","Salida","Total mañana","Entrada","Descanso","Salida","Total Tarde","Notas del día"]
[{"$f":"_xlfn.ISOWEEKNUM(B2)","v":48},"2019-12-01",{"$f":"WEEKDAY(B2,1)","v":"1900-01-01"},{"$f":"IF(OR(C2=1,C2=7),\"Fin de semana\",\"\")","v":"Fin de semana"},null,null,null,{"$f":"IF($G2-$E2=0,\"\",$G2-$E2-$F2)","v":""},null,null,null,{"$f":"IF(AND($D2<>\"Mañana y Tarde\",OR($I2<>\"\",$K2<>\"\")),\"El tipo de día debe ser Mañana y Tarde o no haber horas por la tarde\",IF($K2-$I2=0,\"\",$K2-$I2-$J2))","v":""}]
[{"$f":"_xlfn.ISOWEEKNUM(B3)","v":49},"2019-12-02",{"$f":"WEEKDAY(B3,1)","v":"1900-01-02"},{"$f":"IF(OR(C3=1,C3=7),\"Fin de semana\",\"\")","v":""},null,null,null,{"$f":"IF($G3-$E3=0,\"\",$G3-$E3-$F3)","v":""},null,null,null,{"$f":"IF(AND($D3<>\"Mañana y Tarde\",OR($I3<>\"\",$K3<>\"\")),\"El tipo de día debe ser Mañana y Tarde o no haber horas por la tarde\",IF($K3-$I3=0,\"\",$K3-$I3-$J3))","v":""}]
[49,"2019-12-03","1900-01-03",{"$f":"IF(OR(C4=1,C4=7),\"Fin de semana\",\"\")","v":""},null,null,null,"",null,null,null,""]
[49,"2019-12-04","1900-01-04","",null,null,null,"",null,null,null,""]
[49,"2019-12-05","1900-01-05","",null,null,null,"",null,null,null,""]
[49,"2019-12-06","1900-01-06","Festivo",null,null,null,"",null,null,null,""]
[49,"2019-12-07","1900-01-07","Fin de semana",null,null,null,"",null,null,null,""]
[49,"2019-12-08","1900-01-01","Fin de semana",null,null,null,"",null,null,null,""]
[50,"2019-12-09","1900-01-02","",null,null,null,"",null,null,null,""]
[50,"2019-12-10","1900-01-03","",null,null,null,"",null,null,null,""]
[50,"2019-12-11","1900-01-04","",null,null,null,"",null,null,null,""]
[50,"2019-12-12","1900-01-05","",null,null,null,"",null,null,null,""]
[50,"2019-12-13","1900-01-06","",null,null,null,"",null,null,null,""]
[50,"2019-12-14","1900-01-07","Fin de semana",null,null,null,"",null,null,null,""]
[50,"2019-12-15","1900-01-01","Fin de semana",null,null,null,"",null,null,null,""]
[51,"2019-12-16","1900-01-02","",null,null,null,"",null,null,null,""]
[51,"2019-12-17","1900-01-03","",null,null,null,"",null,null,null,""]
[51,"2019-12-18","1900-01-04","",null,null,null,"",null,null,null,""]
[51,"2019-12-19","1900-01-05","",null,null,null,"",null,null,null,""]
[51,"2019-12-20","1900-01-06","",null,null,null,"",null,null,null,""]
[51,"2019-12-21","1900-01-07","Fin de semana",null,null,null,"",null,null,null,""]
[51,"2019-12-22","1900-01-01","Fin de semana",null,null,null,"",null,null,null,""]
[52,"2019-12-23","1900-01-02","",null,null,null,"",null,null,null,""]
[52,"2019-12-24","1900-01-03","",null,null,null,"",null,null,null,""]
[52,"2019-12-25","1900-01-04","Festivo",null,null,null,"",null,null,null,""]
[52,"2019-12-26","1900-01-05","",null,null,null,"",null,null,null,""]
[52,"2019-12-27","1900-01-06","",null,null,null,"",null,null,null,""]
[52,"2019-12-28","1900-01-07","Fin de semana",null,null,null,"",null,null,null,""]
[52,"2019-12-29","1900-01-01","Fin de semana",null,null,null,"",null,null,null,""]
[1,"2019-12-30","1900-01-02","",null,null,null,"",null,null,null,""]
[1,"2019-12-31","1900-01-03","",null,null,null,"",null,null,null,""]